﻿"Item Id","Item URI","Dublin Core:Title","Dublin Core:Alternative Title","Dublin Core:Subject","Dublin Core:Description","Dublin Core:Abstract","Dublin Core:Table Of Contents","Dublin Core:Creator","Dublin Core:Source","Dublin Core:Publisher","Dublin Core:Date","Dublin Core:Date Available","Dublin Core:Date Created","Dublin Core:Date Accepted","Dublin Core:Date Copyrighted","Dublin Core:Date Submitted","Dublin Core:Date Issued","Dublin Core:Date Modified","Dublin Core:Date Valid","Dublin Core:Contributor","Dublin Core:Rights","Dublin Core:Access Rights","Dublin Core:License","Dublin Core:Relation","Dublin Core:Conforms To","Dublin Core:Has Format","Dublin Core:Has Part","Dublin Core:Has Version","Dublin Core:Is Format Of","Dublin Core:Is Part Of","Dublin Core:Is Referenced By","Dublin Core:Is Replaced By","Dublin Core:Is Required By","Dublin Core:Is Version Of","Dublin Core:References","Dublin Core:Replaces","Dublin Core:Requires","Dublin Core:Format","Dublin Core:Extent","Dublin Core:Medium","Dublin Core:Language","Dublin Core:Type","Dublin Core:Identifier","Dublin Core:Bibliographic Citation","Dublin Core:Coverage","Dublin Core:Spatial Coverage","Dublin Core:Temporal Coverage","Dublin Core:Accrual Method","Dublin Core:Accrual Periodicity","Dublin Core:Accrual Policy","Dublin Core:Audience","Dublin Core:Audience Education Level","Dublin Core:Mediator","Dublin Core:Instructional Method","Dublin Core:Provenance","Dublin Core:Rights Holder","Item Type Metadata:Text","Item Type Metadata:Interviewer","Item Type Metadata:Interviewee","Item Type Metadata:Location","Item Type Metadata:Transcription","Item Type Metadata:Local URL","Item Type Metadata:Original Format","Item Type Metadata:Physical Dimensions","Item Type Metadata:Duration","Item Type Metadata:Compression","Item Type Metadata:Producer","Item Type Metadata:Director","Item Type Metadata:Bit Rate/Frequency","Item Type Metadata:Time Summary","Item Type Metadata:Email Body","Item Type Metadata:Subject Line","Item Type Metadata:From","Item Type Metadata:To","Item Type Metadata:CC","Item Type Metadata:BCC","Item Type Metadata:Number of Attachments","Item Type Metadata:Standards","Item Type Metadata:Objectives","Item Type Metadata:Materials","Item Type Metadata:Lesson Plan Text","Item Type Metadata:URL","Item Type Metadata:Event Type","Item Type Metadata:Participants","Item Type Metadata:Birth Date","Item Type Metadata:Birthplace","Item Type Metadata:Death Date","Item Type Metadata:Occupation","Item Type Metadata:Biographical Text","Item Type Metadata:Bibliography","Item Type Metadata:Transcript","Item Type Metadata:Viewer","Item Type Metadata:Narrator","Item Type Metadata:Production Team","Item Type Metadata:Display Resolution","Item Type Metadata:Frame Rate","Item Type Metadata:Player","Omeka Legacy File:Additional Creator","Omeka Legacy File:Transcriber","Omeka Legacy File:Producer","Omeka Legacy File:Render Device","Omeka Legacy File:Render Details","Omeka Legacy File:Capture Date","Omeka Legacy File:Capture Device","Omeka Legacy File:Capture Details","Omeka Legacy File:Change History","Omeka Legacy File:Watermark","Omeka Legacy File:Encryption","Omeka Legacy File:Compression","Omeka Legacy File:Post Processing","Omeka Image File:Width","Omeka Image File:Height","Omeka Image File:Bit Depth","Omeka Image File:Channels","Omeka Image File:Exif String","Omeka Image File:Exif Array","Omeka Image File:IPTC String","Omeka Image File:IPTC Array","Omeka Video File:Bitrate","Omeka Video File:Duration","Omeka Video File:Sample Rate","Omeka Video File:Codec","Omeka Video File:Width","Omeka Video File:Height","PDF Text:Text",tags,file,itemType,collection,public,featured
21591,https://digitalsc.lib.vt.edu/items/show/21591,"Blacksburg Street Map",,"Local/Regional History and Appalachian South^^Blacksburg (Va.)^^Montgomery County (Va.)^^Maps (documents)","Street map of the town of Blacksburg, prepared for the Blacksburg Engineering Department in 1982.",,,"Blacksburg Engineering Department",,,1982,,,,,,,,,,"<a href=""https://omeka.lib.vt.edu/files/thumbnails/spec_forms/PubPermission.doc"">Permission to publish material must be obtained from Special Collections, Virginia Tech.</a>",,,,,,,,,,,,,,,,,,,,English,Maps,Ms2022_089_blacksburg_map_1982,"Researchers wishing to cite this collection should include the following information: [item name], Sesquicentennial Time Capsule Collection (Ms2022-089), Special Collections, Virginia Polytechnic Institute and State University, Blacksburg, Va.",,,,,,,,,,,,"<a href=""http://spec.lib.vt.edu/"" target=""_blank"" rel=""noreferrer noopener"">Special Collections, University Libraries, Virginia Tech</a>",,,,,,,,,,,,,,,,,,,,,,,,,,,,,,,,,,,,PDF,,,,,,,,,,,,,,,,,,,,,,,,,,,,,,,,,,,https://digitalsc.lib.vt.edu/files/original/ad182cd1f002b4fb5a03facee8590969.pdf,"Still Image","Sesquicentennial Time Capsule Collection (Ms2022-089)",1,0
18460,https://digitalsc.lib.vt.edu/items/show/18460,"Boucher and the Governor",,,"Boucher stands as Charles Robb signs Senate Bill 27",,,"Frederick Boucher","<a href=""https://ead.lib.virginia.edu/vivaxtf/view?docId=oai/lib.vt.edu/repositories/2/resources/3585.oai_ead.xml"">See the Finding Aid for the Frederick C. Boucher Papers</a>",,1982,,,,,,,,,,"<a href=""https://omeka.lib.vt.edu/files/thumbnails/spec_forms/PubPermission.doc"">Permission to publish material from the Frederick C. Boucher Papers must be obtained from Special Collections, Virginia Tech.</a>",,,,,,,,,,,,,,,,,,,,,,2021-048_75_000_125,"Researchers wishing to cite this collection should include the following information: Frederick C. Boucher, Ms2021-048, Special Collections, Virginia Polytechnic Institute and State University, Blacksburg, Va.",,,,,,,,,,,,"<a href=""http://spec.lib.vt.edu/"" target=""_blank"" rel=""noreferrer noopener"">Special Collections, University Libraries, Virginia Tech</a>",,,,,,,,,,,,,,,,,,,,,,,,,,,,,,,,,,,,,,,,,,,,,,,,,,,,,,,,,,,,,,,,,,,,,,,https://digitalsc.lib.vt.edu/files/original/4f97fb78733d10cb1b4d7d9dcf48a60d.jpg,Document,"Rick Boucher Papers (Ms2021-048)",1,0
18457,https://digitalsc.lib.vt.edu/items/show/18457,"Wytheville Radio Interview",,,"Boucher gives an interview on WYVE radio",,,"Frederick Boucher","<a href=""https://ead.lib.virginia.edu/vivaxtf/view?docId=oai/lib.vt.edu/repositories/2/resources/3585.oai_ead.xml"">See the Finding Aid for the Frederick C. Boucher Papers</a>",,1982,,,,,,,,,,"<a href=""https://omeka.lib.vt.edu/files/thumbnails/spec_forms/PubPermission.doc"">Permission to publish material from the Frederick C. Boucher Papers must be obtained from Special Collections, Virginia Tech.</a>",,,,,,,,,,,,,,,,,,,,,,2021-048_75_000_122,"Researchers wishing to cite this collection should include the following information: Frederick C. Boucher, Ms2021-048, Special Collections, Virginia Polytechnic Institute and State University, Blacksburg, Va.",,,,,,,,,,,,"<a href=""http://spec.lib.vt.edu/"" target=""_blank"" rel=""noreferrer noopener"">Special Collections, University Libraries, Virginia Tech</a>",,,,,,,,,,,,,,,,,,,,,,,,,,,,,,,,,,,,,,,,,,,,,,,,,,,,,,,,,,,,,,,,,,,,,,,https://digitalsc.lib.vt.edu/files/original/9dcfa93df7f9cb1c8c13d8436e7ae110.jpg,Document,"Rick Boucher Papers (Ms2021-048)",1,0
18444,https://digitalsc.lib.vt.edu/items/show/18444,"Boucher and Joan Mondale",,,"Boucher sits with Joan Mondale during an event",,,"Frederick Boucher","<a href=""https://ead.lib.virginia.edu/vivaxtf/view?docId=oai/lib.vt.edu/repositories/2/resources/3585.oai_ead.xml"">See the Finding Aid for the Frederick C. Boucher Papers</a>",,1982,,,,,,,,,,"<a href=""https://omeka.lib.vt.edu/files/thumbnails/spec_forms/PubPermission.doc"">Permission to publish material from the Frederick C. Boucher Papers must be obtained from Special Collections, Virginia Tech.</a>",,,,,,,,,,,,,,,,,,,,,,2021-048_75_000_109,"Researchers wishing to cite this collection should include the following information: Frederick C. Boucher, Ms2021-048, Special Collections, Virginia Polytechnic Institute and State University, Blacksburg, Va.",,,,,,,,,,,,"<a href=""http://spec.lib.vt.edu/"" target=""_blank"" rel=""noreferrer noopener"">Special Collections, University Libraries, Virginia Tech</a>",,,,,,,,,,,,,,,,,,,,,,,,,,,,,,,,,,,,,,,,,,,,,,,,,,,,,,,,,,,,,,,,,,,,,,,https://digitalsc.lib.vt.edu/files/original/81f31f20f6b4a3e21c81702d339df957.jpg,Document,"Rick Boucher Papers (Ms2021-048)",1,0
18426,https://digitalsc.lib.vt.edu/items/show/18426,"Boucher and Dick Davis",,,"Boucher shakes hands with Dick Davis at a podium",,,"Frederick Boucher","<a href=""https://ead.lib.virginia.edu/vivaxtf/view?docId=oai/lib.vt.edu/repositories/2/resources/3585.oai_ead.xml"">See the Finding Aid for the Frederick C. Boucher Papers</a>",,1982,,,,,,,,,,"<a href=""https://omeka.lib.vt.edu/files/thumbnails/spec_forms/PubPermission.doc"">Permission to publish material from the Frederick C. Boucher Papers must be obtained from Special Collections, Virginia Tech.</a>",,,,,,,,,,,,,,,,,,,,,,2021-048_75_000_091,"Researchers wishing to cite this collection should include the following information: Frederick C. Boucher, Ms2021-048, Special Collections, Virginia Polytechnic Institute and State University, Blacksburg, Va.",,,,,,,,,,,,"<a href=""http://spec.lib.vt.edu/"" target=""_blank"" rel=""noreferrer noopener"">Special Collections, University Libraries, Virginia Tech</a>",,,,,,,,,,,,,,,,,,,,,,,,,,,,,,,,,,,,,,,,,,,,,,,,,,,,,,,,,,,,,,,,,,,,,,,https://digitalsc.lib.vt.edu/files/original/771851d3e9f50940d3851906839d487d.jpg,Document,"Rick Boucher Papers (Ms2021-048)",1,0
18414,https://digitalsc.lib.vt.edu/items/show/18414,"Introducing Joan Mondale",,,"Boucher introduces Joan Mondale to a crowd at an event",,,"Frederick Boucher","<a href=""https://ead.lib.virginia.edu/vivaxtf/view?docId=oai/lib.vt.edu/repositories/2/resources/3585.oai_ead.xml"">See the Finding Aid for the Frederick C. Boucher Papers</a>",,1982,,,,,,,,,,"<a href=""https://omeka.lib.vt.edu/files/thumbnails/spec_forms/PubPermission.doc"">Permission to publish material from the Frederick C. Boucher Papers must be obtained from Special Collections, Virginia Tech.</a>",,,,,,,,,,,,,,,,,,,,,,2021-048_75_000_079,"Researchers wishing to cite this collection should include the following information: Frederick C. Boucher, Ms2021-048, Special Collections, Virginia Polytechnic Institute and State University, Blacksburg, Va.",,,,,,,,,,,,"<a href=""http://spec.lib.vt.edu/"" target=""_blank"" rel=""noreferrer noopener"">Special Collections, University Libraries, Virginia Tech</a>",,,,,,,,,,,,,,,,,,,,,,,,,,,,,,,,,,,,,,,,,,,,,,,,,,,,,,,,,,,,,,,,,,,,,,,https://digitalsc.lib.vt.edu/files/original/dbb26f28f8a471d0e56be1e99f83ced0.jpg,Document,"Rick Boucher Papers (Ms2021-048)",1,0
13227,https://digitalsc.lib.vt.edu/items/show/13227,"Minority Newsletter, Winter Quarter, 1982",,"University Archives^^University History^^Virginia Polytechnic Institute and State University^^Diversity in higher education","Minority Newsletter (continued by Diversity News LD5655 .A76831 D58)",,,,,,1982,,,,,,,,,,"This Item is protected by copyright and/or related rights. You are free to use this Item in any way that is permitted by the copyright and related rights legislation that applies to your use. In addition, no permission is required from the rights-holder(s) for educational uses. For other uses, you need to obtain permission from the rights-holder(s). <a href=""https://rightsstatements.org/page/InC-EDU/1.0/?language=en"" target=""_blank"">https://rightsstatements.org/page/InC-EDU/1.0/?language=en</a>",,,,,,,,,"Minority Newsletter, LD5655 .A76831 M8",,,,,,,,application/pdf,,,English,Newsletters,LD_5655_A76831_M5_1982_Winter,"Minority Newsletter, [volume, issue, date], Virginia Polytechnic Institute and State University, Blacksburg, Va.",,,,,,,,,,,,"Special Collections and University Archives, Virginia Tech, Blacksburg, Va.",,,,,,,,,,,,,,,,,,,,,,,,,,,,,,,,,,,,PDF,,,,,,,,,,,,,,,,,,,,,,,,,,,,,,,,,,,https://digitalsc.lib.vt.edu/files/original/7decc901cdd613c90220e267f968bb91.pdf,Document,"<em>Minority Newsletter</em> and <em>Diversity News</em>",1,0
13226,https://digitalsc.lib.vt.edu/items/show/13226,"Minority Newsletter, Spring Quarter, 1982",,"University Archives^^University History^^Virginia Polytechnic Institute and State University^^Diversity in higher education","Minority Newsletter (continued by Diversity News LD5655 .A76831 D58)",,,,,,1982,,,,,,,,,,"This Item is protected by copyright and/or related rights. You are free to use this Item in any way that is permitted by the copyright and related rights legislation that applies to your use. In addition, no permission is required from the rights-holder(s) for educational uses. For other uses, you need to obtain permission from the rights-holder(s). <a href=""https://rightsstatements.org/page/InC-EDU/1.0/?language=en"" target=""_blank"">https://rightsstatements.org/page/InC-EDU/1.0/?language=en</a>",,,,,,,,,"Minority Newsletter, LD5655 .A76831 M7",,,,,,,,application/pdf,,,English,Newsletters,LD_5655_A76831_M5_1982_Spring,"Minority Newsletter, [volume, issue, date], Virginia Polytechnic Institute and State University, Blacksburg, Va.",,,,,,,,,,,,"Special Collections and University Archives, Virginia Tech, Blacksburg, Va.",,,,,,,,,,,,,,,,,,,,,,,,,,,,,,,,,,,,PDF,,,,,,,,,,,,,,,,,,,,,,,,,,,,,,,,,,,https://digitalsc.lib.vt.edu/files/original/a268e9c6fcb82d24757e885b97a10a9b.pdf,Document,"<em>Minority Newsletter</em> and <em>Diversity News</em>",1,0
13225,https://digitalsc.lib.vt.edu/items/show/13225,"Minority Newsletter, Fall Quarter, 1982",,"University Archives^^University History^^Virginia Polytechnic Institute and State University^^Diversity in higher education","Minority Newsletter (continued by Diversity News LD5655 .A76831 D58)",,,,,,1982,,,,,,,,,,"This Item is protected by copyright and/or related rights. You are free to use this Item in any way that is permitted by the copyright and related rights legislation that applies to your use. In addition, no permission is required from the rights-holder(s) for educational uses. For other uses, you need to obtain permission from the rights-holder(s). <a href=""https://rightsstatements.org/page/InC-EDU/1.0/?language=en"" target=""_blank"">https://rightsstatements.org/page/InC-EDU/1.0/?language=en</a>",,,,,,,,,"Minority Newsletter, LD5655 .A76831 M6",,,,,,,,application/pdf,,,English,Newsletters,LD_5655_A76831_M5_1982_Fall,"Minority Newsletter, [volume, issue, date], Virginia Polytechnic Institute and State University, Blacksburg, Va.",,,,,,,,,,,,"Special Collections and University Archives, Virginia Tech, Blacksburg, Va.",,,,,,,,,,,,,,,,,,,,,,,,,,,,,,,,,,,,PDF,,,,,,,,,,,,,,,,,,,,,,,,,,,,,,,,,,,https://digitalsc.lib.vt.edu/files/original/5a361e3f1039a0281adf9dd8e5e85d62.pdf,Document,"<em>Minority Newsletter</em> and <em>Diversity News</em>",1,0
11405,https://digitalsc.lib.vt.edu/items/show/11405,"Zero Defects Award Presentation",,"Local/Regional History and Appalachian South^^Photographs","Homer Lineberry (Shift Manager, Winding 2nd Shift), E.E. Maddrey (President, Riegel Textile Corporation), Betty Akers (Zero Defects Achievment Award Winner), Hobert Akers (Husband), Lisa and Sherri Akers (Daughters), H. D. Kingsmore (President, Apparel Fabrics Division), Lane Smith, James Gray",,,"Fries Textile Plant (Fries, Va.)","<a href=""https://ead.lib.virginia.edu/vivaxtf/view?docId=vt/viblbv00590.xml"">See the Finding Aid for the Fries Textile Plant Records</a> ",,1982,,,,,,,,,,"<a href=""https://omeka.lib.vt.edu/files/thumbnails/spec_forms/PubPermission.doc"">Permission to publish material from the Fries Textile Plant Records Collection must be obtained from Special Collections, Virginia Tech.</a>",,,,,,,,,,,,,,,,,,,,,,Ms1989-039_B031_309,"Researchers wishing to cite this collection should include the following information: Fries Textile Plant Records, Ms1989-039, Special Collections, Virginia Polytechnic Institute and State University, Blacksburg, Va.",,,,,,,,,,,,"<a href=""http://spec.lib.vt.edu/"" target=""_blank"" rel=""noreferrer noopener"">Special Collections, University Libraries, Virginia Tech</a>",,,,,,,,,,,,,,,,,,,,,,,,,,,,,,,,,,,,,,,,,,,,,,,,,,,,,,,,,,,,,,,,,,,,,,,https://digitalsc.lib.vt.edu/files/original/f16944ec3fc29f3514a72356af5d3683.jpg,"Still Image","Fries Textile Plant Records, 1900-1988 (Ms1989-039)",1,0
11403,https://digitalsc.lib.vt.edu/items/show/11403,"Award Winner",,"Local/Regional History and Appalachian South^^Photographs","Fries Textile Co. Employee Award presentation, the Whis Farmer Family with John Belvins in the foreground",,,"Fries Textile Plant (Fries, Va.)","<a href=""https://ead.lib.virginia.edu/vivaxtf/view?docId=vt/viblbv00590.xml"">See the Finding Aid for the Fries Textile Plant Records</a> ",,1982,,,,,,,,,,"<a href=""https://omeka.lib.vt.edu/files/thumbnails/spec_forms/PubPermission.doc"">Permission to publish material from the Fries Textile Plant Records Collection must be obtained from Special Collections, Virginia Tech.</a>",,,,,,,,,,,,,,,,,,,,,,Ms1989-039_B031_305,"Researchers wishing to cite this collection should include the following information: Fries Textile Plant Records, Ms1989-039, Special Collections, Virginia Polytechnic Institute and State University, Blacksburg, Va.",,,,,,,,,,,,"<a href=""http://spec.lib.vt.edu/"" target=""_blank"" rel=""noreferrer noopener"">Special Collections, University Libraries, Virginia Tech</a>",,,,,,,,,,,,,,,,,,,,,,,,,,,,,,,,,,,,,,,,,,,,,,,,,,,,,,,,,,,,,,,,,,,,,,,https://digitalsc.lib.vt.edu/files/original/9a4a3ca96e28670041e6acddd617854f.jpg,"Still Image","Fries Textile Plant Records, 1900-1988 (Ms1989-039)",1,0
11401,https://digitalsc.lib.vt.edu/items/show/11401,"Zero Defects Award Presentation",,"Local/Regional History and Appalachian South^^Photographs","Gene Taylor (Shift Manager, Carding 3rd Shift), E.E. Maddrey (President, Riegel Textile Corporation) Raymond Sapp (Award Winner)",,,"Fries Textile Plant (Fries, Va.)","<a href=""https://ead.lib.virginia.edu/vivaxtf/view?docId=vt/viblbv00590.xml"">See the Finding Aid for the Fries Textile Plant Records</a> ",,1982,,,,,,,,,,"<a href=""https://omeka.lib.vt.edu/files/thumbnails/spec_forms/PubPermission.doc"">Permission to publish material from the Fries Textile Plant Records Collection must be obtained from Special Collections, Virginia Tech.</a>",,,,,,,,,,,,,,,,,,,,,,Ms1989-039_B031_302,"Researchers wishing to cite this collection should include the following information: Fries Textile Plant Records, Ms1989-039, Special Collections, Virginia Polytechnic Institute and State University, Blacksburg, Va.",,,,,,,,,,,,"<a href=""http://spec.lib.vt.edu/"" target=""_blank"" rel=""noreferrer noopener"">Special Collections, University Libraries, Virginia Tech</a>",,,,,,,,,,,,,,,,,,,,,,,,,,,,,,,,,,,,,,,,,,,,,,,,,,,,,,,,,,,,,,,,,,,,,,,https://digitalsc.lib.vt.edu/files/original/c549c6ecbd943b06cd82e60c238ecfac.jpg,"Still Image","Fries Textile Plant Records, 1900-1988 (Ms1989-039)",1,0
11400,https://digitalsc.lib.vt.edu/items/show/11400,"Zero Defects Award Presentation",,"Local/Regional History and Appalachian South^^Photographs","Early Doss (Shift Manager, Weaving, 1st Shift), Ralph Vaughan (Award Winner), E.E. Maddrey (President, Riegel Textile Corporation) Rose Vaughan (Mother of Ralph), Jack Bowman (Weaving Mill Manager)",,,"Fries Textile Plant (Fries, Va.)","<a href=""https://ead.lib.virginia.edu/vivaxtf/view?docId=vt/viblbv00590.xml"">See the Finding Aid for the Fries Textile Plant Records</a> ",,1982,,,,,,,,,,"<a href=""https://omeka.lib.vt.edu/files/thumbnails/spec_forms/PubPermission.doc"">Permission to publish material from the Fries Textile Plant Records Collection must be obtained from Special Collections, Virginia Tech.</a>",,,,,,,,,,,,,,,,,,,,,,Ms1989-039_B031_299,"Researchers wishing to cite this collection should include the following information: Fries Textile Plant Records, Ms1989-039, Special Collections, Virginia Polytechnic Institute and State University, Blacksburg, Va.",,,,,,,,,,,,"<a href=""http://spec.lib.vt.edu/"" target=""_blank"" rel=""noreferrer noopener"">Special Collections, University Libraries, Virginia Tech</a>",,,,,,,,,,,,,,,,,,,,,,,,,,,,,,,,,,,,,,,,,,,,,,,,,,,,,,,,,,,,,,,,,,,,,,,https://digitalsc.lib.vt.edu/files/original/71ea21fa18fe4420b7ab3c52be5da1b4.jpg,"Still Image","Fries Textile Plant Records, 1900-1988 (Ms1989-039)",1,0
9243,https://digitalsc.lib.vt.edu/items/show/9243,"The 1982 Bugle",,"University History",,,,,,,1982,,,,,,,,,,,,,,,,,,,,,,,,,,,,,,,Yearbooks,1982Bugle,,,,,,,,,,,,,,,,,,,,,,,,,,,,,,,,,,,,,,,,,,,,,,,,,PDF,,,,,,,,,,,,,,,,,,,,,,,,,,,,,,,,,,,https://digitalsc.lib.vt.edu/files/original/a0af460b0b931b1dc1d1182b31485daa.pdf,Document,<em>Bugles</em>,1,0
9112,https://digitalsc.lib.vt.edu/items/show/9112,"Marva Felder, 1982 Homecoming Queen, hug",,"University History",,,,,,,1982,,,,,,,,,,"Permission to publish material from the Virginia Tech Black History Collection must be obtained from Special Collections, Virginia Tech.",,,,,,,,,,,,,,,,,,,,,Photographs,FelderMarva_HomecomingQueen82,,,,,,,,,,,,,,,,,,,,,,,,,,,,,,,,,,,,,,,,,,,,,,,,,,,,,,,,,,,,,,,,,,,,,,,,,,,,,,,,,,,,http://spec.lib.vt.edu/pickup/Omeka_upload/FelderMarva_HomecomingQueen82.jpg,Document,"Black History at Virginia Tech - Firsts in nonBlack Organizations",1,0
9109,https://digitalsc.lib.vt.edu/items/show/9109,"Marva Felder, 1982 Homecoming Queen, with escort 2",,"University History",,,,,,,1982,,,,,,,,,,"Permission to publish material from the Virginia Tech Black History Collection must be obtained from Special Collections, Virginia Tech.",,,,,,,,,,,,,,,,,,,,,Photographs,Felder_Marva_1982,,,,,,,,,,,,,,,,,,,,,,,,,,,,,,,,,,,,,,,,,,,,,,,,,,,,,,,,,,,,,,,,,,,,,,,,,,,,,,,,,,,,http://spec.lib.vt.edu/pickup/Omeka_upload/Felder_Marva_1982.jpg,Document,"Black History at Virginia Tech - Firsts in nonBlack Organizations",1,0
9108,https://digitalsc.lib.vt.edu/items/show/9108,"Marva Felder, 1982 Homecoming Queen, with escort",,"University History",,,,,,,1982,,,,,,,,,,"Permission to publish material from the Virginia Tech Black History Collection must be obtained from Special Collections, Virginia Tech.",,,,,,,,,,,,,,,,,,,,,Photographs,Felder_Marva_1982_withescort,,,,,,,,,,,,,,,,,,,,,,,,,,,,,,,,,,,,,,,,,,,,,,,,,,,,,,,,,,,,,,,,,,,,,,,,,,,,,,,,,,,,http://spec.lib.vt.edu/pickup/Omeka_upload/Felder_Marva_1982_withescort.jpg,Document,"Black History at Virginia Tech - Firsts in nonBlack Organizations",1,0
9107,https://digitalsc.lib.vt.edu/items/show/9107,"Marva Felder, 1982 Homecoming Queen, parade",,"University History",,,,,,,1982,,,,,,,,,,"Permission to publish material from the Virginia Tech Black History Collection must be obtained from Special Collections, Virginia Tech.",,,,,,,,,,,,,,,,,,,,,Photographs,Felder_Marva_1982_incar,,,,,,,,,,,,,,,,,,,,,,,,,,,,,,,,,,,,,,,,,,,,,,,,,,,,,,,,,,,,,,,,,,,,,,,,,,,,,,,,,,,,http://spec.lib.vt.edu/pickup/Omeka_upload/Felder_Marva_1982_incar.jpg,Document,"Black History at Virginia Tech - Firsts in nonBlack Organizations",1,0
9106,https://digitalsc.lib.vt.edu/items/show/9106,"Marva Felder, 1982 Homecoming Queen, expression",,"University History",,,,,,,1982,,,,,,,,,,"Permission to publish material from the Virginia Tech Black History Collection must be obtained from Special Collections, Virginia Tech.",,,,,,,,,,,,,,,,,,,,,Photographs,Felder_Marva_1982_expression,,,,,,,,,,,,,,,,,,,,,,,,,,,,,,,,,,,,,,,,,,,,,,,,,,,,,,,,,,,,,,,,,,,,,,,,,,,,,,,,,,,,http://spec.lib.vt.edu/pickup/Omeka_upload/Felder_Marva_1982_expression.jpg,Document,"Black History at Virginia Tech - Firsts in nonBlack Organizations",1,0