﻿"Item Id","Item URI","Dublin Core:Title","Dublin Core:Alternative Title","Dublin Core:Subject","Dublin Core:Description","Dublin Core:Abstract","Dublin Core:Table Of Contents","Dublin Core:Creator","Dublin Core:Source","Dublin Core:Publisher","Dublin Core:Date","Dublin Core:Date Available","Dublin Core:Date Created","Dublin Core:Date Accepted","Dublin Core:Date Copyrighted","Dublin Core:Date Submitted","Dublin Core:Date Issued","Dublin Core:Date Modified","Dublin Core:Date Valid","Dublin Core:Contributor","Dublin Core:Rights","Dublin Core:Access Rights","Dublin Core:License","Dublin Core:Relation","Dublin Core:Conforms To","Dublin Core:Has Format","Dublin Core:Has Part","Dublin Core:Has Version","Dublin Core:Is Format Of","Dublin Core:Is Part Of","Dublin Core:Is Referenced By","Dublin Core:Is Replaced By","Dublin Core:Is Required By","Dublin Core:Is Version Of","Dublin Core:References","Dublin Core:Replaces","Dublin Core:Requires","Dublin Core:Format","Dublin Core:Extent","Dublin Core:Medium","Dublin Core:Language","Dublin Core:Type","Dublin Core:Identifier","Dublin Core:Bibliographic Citation","Dublin Core:Coverage","Dublin Core:Spatial Coverage","Dublin Core:Temporal Coverage","Dublin Core:Accrual Method","Dublin Core:Accrual Periodicity","Dublin Core:Accrual Policy","Dublin Core:Audience","Dublin Core:Audience Education Level","Dublin Core:Mediator","Dublin Core:Instructional Method","Dublin Core:Provenance","Dublin Core:Rights Holder","Item Type Metadata:Text","Item Type Metadata:Interviewer","Item Type Metadata:Interviewee","Item Type Metadata:Location","Item Type Metadata:Transcription","Item Type Metadata:Local URL","Item Type Metadata:Original Format","Item Type Metadata:Physical Dimensions","Item Type Metadata:Duration","Item Type Metadata:Compression","Item Type Metadata:Producer","Item Type Metadata:Director","Item Type Metadata:Bit Rate/Frequency","Item Type Metadata:Time Summary","Item Type Metadata:Email Body","Item Type Metadata:Subject Line","Item Type Metadata:From","Item Type Metadata:To","Item Type Metadata:CC","Item Type Metadata:BCC","Item Type Metadata:Number of Attachments","Item Type Metadata:Standards","Item Type Metadata:Objectives","Item Type Metadata:Materials","Item Type Metadata:Lesson Plan Text","Item Type Metadata:URL","Item Type Metadata:Event Type","Item Type Metadata:Participants","Item Type Metadata:Birth Date","Item Type Metadata:Birthplace","Item Type Metadata:Death Date","Item Type Metadata:Occupation","Item Type Metadata:Biographical Text","Item Type Metadata:Bibliography","Item Type Metadata:Transcript","Item Type Metadata:Viewer","Item Type Metadata:Narrator","Item Type Metadata:Production Team","Item Type Metadata:Display Resolution","Item Type Metadata:Frame Rate","Item Type Metadata:Player","Omeka Legacy File:Additional Creator","Omeka Legacy File:Transcriber","Omeka Legacy File:Producer","Omeka Legacy File:Render Device","Omeka Legacy File:Render Details","Omeka Legacy File:Capture Date","Omeka Legacy File:Capture Device","Omeka Legacy File:Capture Details","Omeka Legacy File:Change History","Omeka Legacy File:Watermark","Omeka Legacy File:Encryption","Omeka Legacy File:Compression","Omeka Legacy File:Post Processing","Omeka Image File:Width","Omeka Image File:Height","Omeka Image File:Bit Depth","Omeka Image File:Channels","Omeka Image File:Exif String","Omeka Image File:Exif Array","Omeka Image File:IPTC String","Omeka Image File:IPTC Array","Omeka Video File:Bitrate","Omeka Video File:Duration","Omeka Video File:Sample Rate","Omeka Video File:Codec","Omeka Video File:Width","Omeka Video File:Height","PDF Text:Text",tags,file,itemType,collection,public,featured
4924,https://digitalsc.lib.vt.edu/items/show/4924,"Letter, Catlett Conway to Willy, Richmond, VA, July 23, 1901 (Ms2012-039)",,"Conway, Mary Wallace^^Conway, William Buchanan, 1845-1919^^Conway, Battaile Fitzhugh Taliaferro^^Conway, Henry^^Virginia--History^^Local/Regional History and Appalachian South^^Civil War^^United States--History--Civil War, 1861-1865^^Letters","Letter from Catlett Conway to Willy, describing his medical regimen with the help of Willy's prescription; commenting on the high heat of the summer; and lamenting the lack of published personal experiences of Confederate soldiers in the Richmond Dispatch, now filled with ""the form of the Confederate Government and its constitution as compared to that of the United States.""",,,"Conway, John C.^^Conway, Catlett, 1840-1920","<a href=""http://search.vaheritage.org/vivaxtf/view?docId=vt/viblbv01051.xml"" target=""_blank"">See the Finding Aid for the Catlett Conway Collection</a>",,1901-07-23,,,,,,,,,,"<a href=""https://digitalsc.lib.vt.edu/files/thumbnails/spec_forms/PubPermission.doc"" target=""_blank"">Permission to publish material from Catlett Conway Correspondence must be obtained from Special Collections, Virginia Tech.</a>",,,,,,,,,"Ms2012-039, Box 1, Folder 3",,,,,,,,,,,eng,Letters,Ms2012-039_ConwayCatlett_F3_Letter_1901_0723,"Researchers wishing to cite this collection should include the following information: Catlett Conway Correspondence, Ms2012-039, Special Collections, Virginia Tech, Blacksburg, Va.",,,,,,,,,,,,"<a href=""http://spec.lib.vt.edu"" target=""_blank"">Special Collections, University Libraries, Virginia Tech</a>",,,,,,,,,,,,,,,,,,,,,,,,,,,,,,,,,,,,,,,,,,,,,,,,,,,,,,,,,,,,,,,,,,,,,,,"http://spec.lib.vt.edu/pickup/Omeka_upload/Ms2012-039_ConwayCatlett_F3_Letter_1901_0723_enva.jpg,http://spec.lib.vt.edu/pickup/Omeka_upload/Ms2012-039_ConwayCatlett_F3_Letter_1901_0723_envb.jpg,http://spec.lib.vt.edu/pickup/Omeka_upload/Ms2012-039_ConwayCatlett_F3_Letter_1901_0723a.jpg,http://spec.lib.vt.edu/pickup/Omeka_upload/Ms2012-039_ConwayCatlett_F3_Letter_1901_0723b.jpg",Document,"Catlett Conway Correspondence, 1892-1920 (Ms2012-039)",1,0
4902,https://digitalsc.lib.vt.edu/items/show/4902,"Letter, Catlett Conway to Willy, Richmond, VA, July 4, 1895 (Ms2012-039)",,"Conway, Battaile Fitzhugh Taliaferro^^Conway, Henry^^Conway, Mary Wallace^^Conway, William Buchanan, 1845-1919^^Letters^^United States--History--Civil War, 1861-1865^^Civil War^^Local/Regional History and Appalachian South^^Virginia--History",,,,"Conway, Catlett, 1840-1920^^Conway, John C.","<a href=""http://search.vaheritage.org/vivaxtf/view?docId=vt/viblbv01051.xml"" target=""_blank"">See the Finding Aid for the Catlett Conway Collection</a>",,1895-07-04,,,,,,,,,,"<a href=""https://digitalsc.lib.vt.edu/files/thumbnails/spec_forms/PubPermission.doc"" target=""_blank"">Permission to publish material from Catlett Conway Correspondence must be obtained from Special Collections, Virginia Tech.</a>",,,,,,,,,"Ms2012-039, Box 1, Folder 1",,,,,,,,,,,eng,Letters,Ms2012-039_ConwayCatlett_F1_Letter_1895_0704,"Researchers wishing to cite this collection should include the following information: Catlett Conway Correspondence, Ms2012-039, Special Collections, Virginia Tech, Blacksburg, Va.",,,,,,,,,,,,"<a href=""http://spec.lib.vt.edu"" target=""_blank"">Special Collections, University Libraries, Virginia Tech</a>",,,,,,,,,,,,,,,,,,,,,,,,,,,,,,,,,,,,,,,,,,,,,,,,,,,,,,,,,,,,,,,,,,,,,,,"http://spec.lib.vt.edu/pickup/Omeka_upload/Ms2012-039_ConwayCatlett_F1_Letter_1895_0704_enva.jpg,http://spec.lib.vt.edu/pickup/Omeka_upload/Ms2012-039_ConwayCatlett_F1_Letter_1895_0704_envb.jpg,http://spec.lib.vt.edu/pickup/Omeka_upload/Ms2012-039_ConwayCatlett_F1_Letter_1895_0704a.jpg,http://spec.lib.vt.edu/pickup/Omeka_upload/Ms2012-039_ConwayCatlett_F1_Letter_1895_0704b.jpg,http://spec.lib.vt.edu/pickup/Omeka_upload/Ms2012-039_ConwayCatlett_F1_Letter_1895_0704c.jpg,http://spec.lib.vt.edu/pickup/Omeka_upload/Ms2012-039_ConwayCatlett_F1_Letter_1895_0704d.jpg",Document,"Catlett Conway Correspondence, 1892-1920 (Ms2012-039)",1,0
4921,https://digitalsc.lib.vt.edu/items/show/4921,"Letter, Catlett Conway to Willy, Richmond, VA, June 16, 1901 (Ms2012-039)",,"Conway, William Buchanan, 1845-1919^^Conway, Mary Wallace^^Conway, Henry^^Conway, Battaile Fitzhugh Taliaferro^^Letters^^Civil War^^United States--History--Civil War, 1861-1865^^Virginia--History^^Local/Regional History and Appalachian South","Letter from Catlett Conway to Willy, detailing his most recent health issues and expressing his wish for Willy",,,"Conway, John C.^^Conway, Catlett, 1840-1920","<a href=""http://search.vaheritage.org/vivaxtf/view?docId=vt/viblbv01051.xml"" target=""_blank"">See the Finding Aid for the Catlett Conway Collection</a>",,1901-06-16,,,,,,,,,,"<a href=""https://digitalsc.lib.vt.edu/files/thumbnails/spec_forms/PubPermission.doc"" target=""_blank"">Permission to publish material from Catlett Conway Correspondence must be obtained from Special Collections, Virginia Tech.</a>",,,,,,,,,"Ms2012-039, Box 1, Folder 3",,,,,,,,,,,eng,Letters,Ms2012-039_ConwayCatlett_F3_Letter_1901_0616,"Researchers wishing to cite this collection should include the following information: Catlett Conway Correspondence, Ms2012-039, Special Collections, Virginia Tech, Blacksburg, Va.",,,,,,,,,,,,"<a href=""http://spec.lib.vt.edu"" target=""_blank"">Special Collections, University Libraries, Virginia Tech</a>",,,,,,,,,,,,,,,,,,,,,,,,,,,,,,,,,,,,,,,,,,,,,,,,,,,,,,,,,,,,,,,,,,,,,,,"http://spec.lib.vt.edu/pickup/Omeka_upload/Ms2012-039_ConwayCatlett_F3_Letter_1901_0616_enva.jpg,http://spec.lib.vt.edu/pickup/Omeka_upload/Ms2012-039_ConwayCatlett_F3_Letter_1901_0616_envb.jpg,http://spec.lib.vt.edu/pickup/Omeka_upload/Ms2012-039_ConwayCatlett_F3_Letter_1901_0616a.jpg,http://spec.lib.vt.edu/pickup/Omeka_upload/Ms2012-039_ConwayCatlett_F3_Letter_1901_0616b.jpg,http://spec.lib.vt.edu/pickup/Omeka_upload/Ms2012-039_ConwayCatlett_F3_Letter_1901_0616c.jpg,http://spec.lib.vt.edu/pickup/Omeka_upload/Ms2012-039_ConwayCatlett_F3_Letter_1901_0616d.jpg,http://spec.lib.vt.edu/pickup/Omeka_upload/Ms2012-039_ConwayCatlett_F3_Letter_1901_0616e.jpg,http://spec.lib.vt.edu/pickup/Omeka_upload/Ms2012-039_ConwayCatlett_F3_Letter_1901_0616f.jpg,http://spec.lib.vt.edu/pickup/Omeka_upload/Ms2012-039_ConwayCatlett_F3_Letter_1901_0616g.jpg,http://spec.lib.vt.edu/pickup/Omeka_upload/Ms2012-039_ConwayCatlett_F3_Letter_1901_0616h.jpg",Document,"Catlett Conway Correspondence, 1892-1920 (Ms2012-039)",1,0
4922,https://digitalsc.lib.vt.edu/items/show/4922,"Letter, Catlett Conway to Willy, Richmond, VA, June 25, 1901 (Ms2012-039)",,"Conway, Mary Wallace^^Conway, William Buchanan, 1845-1919^^Conway, Henry^^Conway, Battaile Fitzhugh Taliaferro^^Letters^^United States--History--Civil War, 1861-1865^^Civil War^^Local/Regional History and Appalachian South^^Virginia--History","Letter from Catlett Conway to Willy, describing the state of his illness and thanking Willy for prescriptions sent in response, and recounting a dramatic tale of a Civil War battle in which the Confederate side was victorious.",,,"Conway, John C.^^Conway, Catlett, 1840-1920","<a href=""http://search.vaheritage.org/vivaxtf/view?docId=vt/viblbv01051.xml"" target=""_blank"">See the Finding Aid for the Catlett Conway Collection</a>",,1901-06-25,,,,,,,,,,"<a href=""https://digitalsc.lib.vt.edu/files/thumbnails/spec_forms/PubPermission.doc"" target=""_blank"">Permission to publish material from Catlett Conway Correspondence must be obtained from Special Collections, Virginia Tech.</a>",,,,,,,,,"Ms2012-039, Box 1, Folder 3",,,,,,,,,,,eng,Letters,Ms2012-039_ConwayCatlett_F3_Letter_1901_0625,"Researchers wishing to cite this collection should include the following information: Catlett Conway Correspondence, Ms2012-039, Special Collections, Virginia Tech, Blacksburg, Va.",,,,,,,,,,,,"<a href=""http://spec.lib.vt.edu"" target=""_blank"">Special Collections, University Libraries, Virginia Tech</a>",,,,,,,,,,,,,,,,,,,,,,,,,,,,,,,,,,,,,,,,,,,,,,,,,,,,,,,,,,,,,,,,,,,,,,,"http://spec.lib.vt.edu/pickup/Omeka_upload/Ms2012-039_ConwayCatlett_F3_Letter_1901_0625_enva.jpg,http://spec.lib.vt.edu/pickup/Omeka_upload/Ms2012-039_ConwayCatlett_F3_Letter_1901_0625_envb.jpg,http://spec.lib.vt.edu/pickup/Omeka_upload/Ms2012-039_ConwayCatlett_F3_Letter_1901_0625a.jpg,http://spec.lib.vt.edu/pickup/Omeka_upload/Ms2012-039_ConwayCatlett_F3_Letter_1901_0625b.jpg",Document,"Catlett Conway Correspondence, 1892-1920 (Ms2012-039)",1,0
4923,https://digitalsc.lib.vt.edu/items/show/4923,"Letter, Catlett Conway to Willy, Richmond, VA, June 28, 1901 (Ms2012-039)",,"Conway, William Buchanan, 1845-1919^^Conway, Mary Wallace^^Conway, Henry^^Conway, Battaile Fitzhugh Taliaferro^^Civil War^^United States--History--Civil War, 1861-1865^^Letters^^Virginia--History^^Local/Regional History and Appalachian South","Letter from Catlett Conway to Willy, praising the help of Willy",,,"Conway, John C.^^Conway, Catlett, 1840-1920","<a href=""http://search.vaheritage.org/vivaxtf/view?docId=vt/viblbv01051.xml"" target=""_blank"">See the Finding Aid for the Catlett Conway Collection</a>",,1901-06-28,,,,,,,,,,"<a href=""https://digitalsc.lib.vt.edu/files/thumbnails/spec_forms/PubPermission.doc"" target=""_blank"">Permission to publish material from Catlett Conway Correspondence must be obtained from Special Collections, Virginia Tech.</a>",,,,,,,,,"Ms2012-039, Box 1, Folder 3",,,,,,,,,,,eng,Letters,Ms2012-039_ConwayCatlett_F3_Letter_1901_0628,"Researchers wishing to cite this collection should include the following information: Catlett Conway Correspondence, Ms2012-039, Special Collections, Virginia Tech, Blacksburg, Va.",,,,,,,,,,,,"<a href=""http://spec.lib.vt.edu"" target=""_blank"">Special Collections, University Libraries, Virginia Tech</a>",,,,,,,,,,,,,,,,,,,,,,,,,,,,,,,,,,,,,,,,,,,,,,,,,,,,,,,,,,,,,,,,,,,,,,,"http://spec.lib.vt.edu/pickup/Omeka_upload/Ms2012-039_ConwayCatlett_F3_Letter_1901_0628_enva.jpg,http://spec.lib.vt.edu/pickup/Omeka_upload/Ms2012-039_ConwayCatlett_F3_Letter_1901_0628_envb.jpg,http://spec.lib.vt.edu/pickup/Omeka_upload/Ms2012-039_ConwayCatlett_F3_Letter_1901_0628a.jpg,http://spec.lib.vt.edu/pickup/Omeka_upload/Ms2012-039_ConwayCatlett_F3_Letter_1901_0628b.jpg,http://spec.lib.vt.edu/pickup/Omeka_upload/Ms2012-039_ConwayCatlett_F3_Letter_1901_0628c.jpg,http://spec.lib.vt.edu/pickup/Omeka_upload/Ms2012-039_ConwayCatlett_F3_Letter_1901_0628d.jpg",Document,"Catlett Conway Correspondence, 1892-1920 (Ms2012-039)",1,0
4901,https://digitalsc.lib.vt.edu/items/show/4901,"Letter, Catlett Conway to Willy, Richmond, VA, March 14, 1895 (Ms2012-039)",,"Conway, Henry^^Conway, William Buchanan, 1845-1919^^Conway, Mary Wallace^^Conway, Battaile Fitzhugh Taliaferro^^Local/Regional History and Appalachian South^^Virginia--History^^Letters^^Civil War^^United States--History--Civil War, 1861-1865",,,,"Conway, John C.^^Conway, Catlett, 1840-1920","<a href=""http://search.vaheritage.org/vivaxtf/view?docId=vt/viblbv01051.xml"" target=""_blank"">See the Finding Aid for the Catlett Conway Collection</a>",,1895-03-14,,,,,,,,,,"<a href=""https://digitalsc.lib.vt.edu/files/thumbnails/spec_forms/PubPermission.doc"" target=""_blank"">Permission to publish material from Catlett Conway Correspondence must be obtained from Special Collections, Virginia Tech.</a>",,,,,,,,,"Ms2012-039, Box 1, Folder 1",,,,,,,,,,,eng,Letters,Ms2012-039_ConwayCatlett_F1_Letter_1895_0314,"Researchers wishing to cite this collection should include the following information: Catlett Conway Correspondence, Ms2012-039, Special Collections, Virginia Tech, Blacksburg, Va.",,,,,,,,,,,,"<a href=""http://spec.lib.vt.edu"" target=""_blank"">Special Collections, University Libraries, Virginia Tech</a>",,,,,,,,,,,,,,,,,,,,,,,,,,,,,,,,,,,,,,,,,,,,,,,,,,,,,,,,,,,,,,,,,,,,,,,"http://spec.lib.vt.edu/pickup/Omeka_upload/Ms2012-039_ConwayCatlett_F1_Letter_1895_0314a.jpg,http://spec.lib.vt.edu/pickup/Omeka_upload/Ms2012-039_ConwayCatlett_F1_Letter_1895_0314b.jpg,http://spec.lib.vt.edu/pickup/Omeka_upload/Ms2012-039_ConwayCatlett_F1_Letter_1895_0314c.jpg,http://spec.lib.vt.edu/pickup/Omeka_upload/Ms2012-039_ConwayCatlett_F1_Letter_1895_0314d.jpg,http://spec.lib.vt.edu/pickup/Omeka_upload/Ms2012-039_ConwayCatlett_F1_Letter_1895_0314e.jpg",Document,"Catlett Conway Correspondence, 1892-1920 (Ms2012-039)",1,0
4918,https://digitalsc.lib.vt.edu/items/show/4918,"Letter, Catlett Conway to Willy, Richmond, VA, March 14, 1900 (Ms2012-039)",,"Conway, Battaile Fitzhugh Taliaferro^^Conway, William Buchanan, 1845-1919^^Conway, Mary Wallace^^Conway, Henry^^Civil War^^Local/Regional History and Appalachian South^^Letters^^United States--History--Civil War, 1861-1865^^Virginia--History","Letter from Catlett Conway to Willy, describing his time as a patient in the Virginia Hospital as he underwent various treatments for pneumonia, and concluding by recalling memories of his and Willy",,,"Conway, Catlett, 1840-1920^^Conway, John C.","<a href=""http://search.vaheritage.org/vivaxtf/view?docId=vt/viblbv01051.xml"" target=""_blank"">See the Finding Aid for the Catlett Conway Collection</a>",,1900-03-14,,,,,,,,,,"<a href=""https://digitalsc.lib.vt.edu/files/thumbnails/spec_forms/PubPermission.doc"" target=""_blank"">Permission to publish material from Catlett Conway Correspondence must be obtained from Special Collections, Virginia Tech.</a>",,,,,,,,,"Ms2012-039, Box 1, Folder 3",,,,,,,,,,,eng,Letters,Ms2012-039_ConwayCatlett_F3_Letter_1900_0314,"Researchers wishing to cite this collection should include the following information: Catlett Conway Correspondence, Ms2012-039, Special Collections, Virginia Tech, Blacksburg, Va.",,,,,,,,,,,,"<a href=""http://spec.lib.vt.edu"" target=""_blank"">Special Collections, University Libraries, Virginia Tech</a>",,,,,,,,,,,,,,,,,,,,,,,,,,,,,,,,,,,,,,,,,,,,,,,,,,,,,,,,,,,,,,,,,,,,,,,"http://spec.lib.vt.edu/pickup/Omeka_upload/Ms2012-039_ConwayCatlett_F3_Letter_1900_0314_enva.jpg,http://spec.lib.vt.edu/pickup/Omeka_upload/Ms2012-039_ConwayCatlett_F3_Letter_1900_0314_envb.jpg,http://spec.lib.vt.edu/pickup/Omeka_upload/Ms2012-039_ConwayCatlett_F3_Letter_1900_0314a.jpg,http://spec.lib.vt.edu/pickup/Omeka_upload/Ms2012-039_ConwayCatlett_F3_Letter_1900_0314b.jpg,http://spec.lib.vt.edu/pickup/Omeka_upload/Ms2012-039_ConwayCatlett_F3_Letter_1900_0314c.jpg,http://spec.lib.vt.edu/pickup/Omeka_upload/Ms2012-039_ConwayCatlett_F3_Letter_1900_0314d.jpg,http://spec.lib.vt.edu/pickup/Omeka_upload/Ms2012-039_ConwayCatlett_F3_Letter_1900_0314e.jpg,http://spec.lib.vt.edu/pickup/Omeka_upload/Ms2012-039_ConwayCatlett_F3_Letter_1900_0314f.jpg",Document,"Catlett Conway Correspondence, 1892-1920 (Ms2012-039)",1,0
4897,https://digitalsc.lib.vt.edu/items/show/4897,"Letter, Catlett Conway to Willy, Richmond, VA, March 17, 1894 (Ms2012-039)",,"Conway, William Buchanan, 1845-1919^^Conway, Mary Wallace^^Conway, Henry^^Conway, Battaile Fitzhugh Taliaferro^^Virginia--History^^Civil War^^Local/Regional History and Appalachian South^^Letters^^United States--History--Civil War, 1861-1865",,,,"Conway, John C.^^Conway, Catlett, 1840-1920","<a href=""http://search.vaheritage.org/vivaxtf/view?docId=vt/viblbv01051.xml"" target=""_blank"">See the Finding Aid for the Catlett Conway Collection</a>",,1894-03-17,,,,,,,,,,"<a href=""https://digitalsc.lib.vt.edu/files/thumbnails/spec_forms/PubPermission.doc"" target=""_blank"">Permission to publish material from Catlett Conway Correspondence must be obtained from Special Collections, Virginia Tech.</a>",,,,,,,,,"Ms2012-039, Box 1, Folder 1",,,,,,,,,,,eng,Letters,Ms2012-039_ConwayCatlett_F1_Letter_1894_0317,"Researchers wishing to cite this collection should include the following information: Catlett Conway Correspondence, Ms2012-039, Special Collections, Virginia Tech, Blacksburg, Va.",,,,,,,,,,,,"<a href=""http://spec.lib.vt.edu"" target=""_blank"">Special Collections, University Libraries, Virginia Tech</a>",,,,,,,,,,,,,,,,,,,,,,,,,,,,,,,,,,,,,,,,,,,,,,,,,,,,,,,,,,,,,,,,,,,,,,,"http://spec.lib.vt.edu/pickup/Omeka_upload/Ms2012-039_ConwayCatlett_F1_Letter_1894_0317_enva.jpg,http://spec.lib.vt.edu/pickup/Omeka_upload/Ms2012-039_ConwayCatlett_F1_Letter_1894_0317_envb.jpg,http://spec.lib.vt.edu/pickup/Omeka_upload/Ms2012-039_ConwayCatlett_F1_Letter_1894_0317a.jpg,http://spec.lib.vt.edu/pickup/Omeka_upload/Ms2012-039_ConwayCatlett_F1_Letter_1894_0317b.jpg,http://spec.lib.vt.edu/pickup/Omeka_upload/Ms2012-039_ConwayCatlett_F1_Letter_1894_0317c.jpg,http://spec.lib.vt.edu/pickup/Omeka_upload/Ms2012-039_ConwayCatlett_F1_Letter_1894_0317d.jpg",Document,"Catlett Conway Correspondence, 1892-1920 (Ms2012-039)",1,0
4895,https://digitalsc.lib.vt.edu/items/show/4895,"Letter, Catlett Conway to Willy, Richmond, VA, November 10, 1892 (Ms2012-039)",,"Conway, William Buchanan, 1845-1919^^Conway, Mary Wallace^^Conway, Henry^^Conway, Battaile Fitzhugh Taliaferro^^Virginia--History^^Local/Regional History and Appalachian South^^Civil War^^United States--History--Civil War, 1861-1865^^Letters",,,,"Conway, John C.^^Conway, Catlett, 1840-1920","<a href=""http://search.vaheritage.org/vivaxtf/view?docId=vt/viblbv01051.xml"" target=""_blank"">See the Finding Aid for the Catlett Conway Collection</a>",,1892-11-10,,,,,,,,,,"<a href=""https://digitalsc.lib.vt.edu/files/thumbnails/spec_forms/PubPermission.doc"" target=""_blank"">Permission to publish material from Catlett Conway Correspondence must be obtained from Special Collections, Virginia Tech.</a>",,,,,,,,,"Ms2012-039, Box 1, Folder 1",,,,,,,,,,,eng,Letters,Ms2012-039_ConwayCatlett_F1_Letter_1892_1110,"Researchers wishing to cite this collection should include the following information: Catlett Conway Correspondence, Ms2012-039, Special Collections, Virginia Tech, Blacksburg, Va.",,,,,,,,,,,,"<a href=""http://spec.lib.vt.edu"" target=""_blank"">Special Collections, University Libraries, Virginia Tech</a>",,,,,,,,,,,,,,,,,,,,,,,,,,,,,,,,,,,,,,,,,,,,,,,,,,,,,,,,,,,,,,,,,,,,,,,"http://spec.lib.vt.edu/pickup/Omeka_upload/Ms2012-039_ConwayCatlett_F1_Letter_1892_1110a.jpg,http://spec.lib.vt.edu/pickup/Omeka_upload/Ms2012-039_ConwayCatlett_F1_Letter_1892_1110b.jpg",Document,"Catlett Conway Correspondence, 1892-1920 (Ms2012-039)",1,0