﻿"Item Id","Item URI","Dublin Core:Title","Dublin Core:Alternative Title","Dublin Core:Subject","Dublin Core:Description","Dublin Core:Abstract","Dublin Core:Table Of Contents","Dublin Core:Creator","Dublin Core:Source","Dublin Core:Publisher","Dublin Core:Date","Dublin Core:Date Available","Dublin Core:Date Created","Dublin Core:Date Accepted","Dublin Core:Date Copyrighted","Dublin Core:Date Submitted","Dublin Core:Date Issued","Dublin Core:Date Modified","Dublin Core:Date Valid","Dublin Core:Contributor","Dublin Core:Rights","Dublin Core:Access Rights","Dublin Core:License","Dublin Core:Relation","Dublin Core:Conforms To","Dublin Core:Has Format","Dublin Core:Has Part","Dublin Core:Has Version","Dublin Core:Is Format Of","Dublin Core:Is Part Of","Dublin Core:Is Referenced By","Dublin Core:Is Replaced By","Dublin Core:Is Required By","Dublin Core:Is Version Of","Dublin Core:References","Dublin Core:Replaces","Dublin Core:Requires","Dublin Core:Format","Dublin Core:Extent","Dublin Core:Medium","Dublin Core:Language","Dublin Core:Type","Dublin Core:Identifier","Dublin Core:Bibliographic Citation","Dublin Core:Coverage","Dublin Core:Spatial Coverage","Dublin Core:Temporal Coverage","Dublin Core:Accrual Method","Dublin Core:Accrual Periodicity","Dublin Core:Accrual Policy","Dublin Core:Audience","Dublin Core:Audience Education Level","Dublin Core:Mediator","Dublin Core:Instructional Method","Dublin Core:Provenance","Dublin Core:Rights Holder","Item Type Metadata:Text","Item Type Metadata:Interviewer","Item Type Metadata:Interviewee","Item Type Metadata:Location","Item Type Metadata:Transcription","Item Type Metadata:Local URL","Item Type Metadata:Original Format","Item Type Metadata:Physical Dimensions","Item Type Metadata:Duration","Item Type Metadata:Compression","Item Type Metadata:Producer","Item Type Metadata:Director","Item Type Metadata:Bit Rate/Frequency","Item Type Metadata:Time Summary","Item Type Metadata:Email Body","Item Type Metadata:Subject Line","Item Type Metadata:From","Item Type Metadata:To","Item Type Metadata:CC","Item Type Metadata:BCC","Item Type Metadata:Number of Attachments","Item Type Metadata:Standards","Item Type Metadata:Objectives","Item Type Metadata:Materials","Item Type Metadata:Lesson Plan Text","Item Type Metadata:URL","Item Type Metadata:Event Type","Item Type Metadata:Participants","Item Type Metadata:Birth Date","Item Type Metadata:Birthplace","Item Type Metadata:Death Date","Item Type Metadata:Occupation","Item Type Metadata:Biographical Text","Item Type Metadata:Bibliography","Item Type Metadata:Transcript","Item Type Metadata:Viewer","Item Type Metadata:Narrator","Item Type Metadata:Production Team","Item Type Metadata:Display Resolution","Item Type Metadata:Frame Rate","Item Type Metadata:Player","Omeka Legacy File:Additional Creator","Omeka Legacy File:Transcriber","Omeka Legacy File:Producer","Omeka Legacy File:Render Device","Omeka Legacy File:Render Details","Omeka Legacy File:Capture Date","Omeka Legacy File:Capture Device","Omeka Legacy File:Capture Details","Omeka Legacy File:Change History","Omeka Legacy File:Watermark","Omeka Legacy File:Encryption","Omeka Legacy File:Compression","Omeka Legacy File:Post Processing","Omeka Image File:Width","Omeka Image File:Height","Omeka Image File:Bit Depth","Omeka Image File:Channels","Omeka Image File:Exif String","Omeka Image File:Exif Array","Omeka Image File:IPTC String","Omeka Image File:IPTC Array","Omeka Video File:Bitrate","Omeka Video File:Duration","Omeka Video File:Sample Rate","Omeka Video File:Codec","Omeka Video File:Width","Omeka Video File:Height","PDF Text:Text",tags,file,itemType,collection,public,featured
18183,https://digitalsc.lib.vt.edu/items/show/18183,"Letter, J. Robert Oppenheimer to Robert E. Marshak, nd (Ms1988-060)",,Correspondence,"Thank you note, undated, from J. Robert Oppenheimer to Robert E. Marshak. Oppenheimer was thanking Marshak for his note on Okubo [probably University of Rochester physicist Susumu Okubo], and telling him to have a good time on his trip.",,,"Oppenheimer, J. Robert, 1904-1967","<a href=""https://ead.lib.virginia.edu/vivaxtf/view?docId=oai/lib.vt.edu/repositories/2/resources/3579.oai_ead.xml"" target=""_blank"">See the finding aid for the Robert E. Marshak Papers.</a>",,undated,,,,,,,,,,"This Item is protected by copyright and/or related rights. You are free to use this Item in any way that is permitted by the copyright and related rights legislation that applies to your use. In addition, no permission is required from the rights-holder(s) for educational uses. For other uses, you need to obtain permission from the rights-holder(s). <a href=""https://rightsstatements.org/page/InC-EDU/1.0/?language=en"">https://rightsstatements.org/page/InC-EDU/1.0/?language=en</a>.",,,,,,,,,"Ms1988-060, Box 16, Folder 03",,,,,,,,image/jpg,,,English,Letters,Ms1988_060_B16F03_OppenheimertoMarshak_letter_nd,"Researchers wishing to cite this collection should include the following information: [identification of item], [box], [folder], Robert E. Marshak Papers, Ms1988-060, Special Collections and University Archives, Virginia Tech, Blacksburg, Va.",,,,,,,,,,,,"Special Collections and University Archives, Virginia Tech",,,,,,,,,,,,,,,,,,,,,,,,,,,,,,,,,,,,,,,,,,,,,,,,,,,,,,,,,,,,,,,,,,,,,,,https://digitalsc.lib.vt.edu/files/original/d722ac899a08b993b5557b9ad9ae0b98.jpg,,"Robert E. Marshak Papers (Ms1988-060)",1,0
12328,https://digitalsc.lib.vt.edu/items/show/12328,"Mass Card from Society of the Little Flower, C02096 (Ms2008-020)",,"University Archives^^April 16, 2007 shootings^^Correspondence","A memorial mass enrollment card from the Society of the Little Flower requested by ""A Mother - Florida"".",,,"Society of the Little Flower","<a href=""http://ead.lib.virginia.edu/vivaxtf/view?docId=vt/viblbv00656.xml"">See the finding aid for the Virginia Tech April 16, 2007 Archives of the University Libraries</a>.",,undated,,,,,,,,,,"This Item is protected by copyright and/or related rights. You are free to use this Item in any way that is permitted by the copyright and related rights legislation that applies to your use. For other uses you need to obtain permission from the rights-holder(s). <a href=""https://rightsstatements.org/page/InC/1.0/?language=en"" target=""_blank"">https://rightsstatements.org/page/InC/1.0/?language=en</a>",,,,,,,,,"Ms2008-020, Box 348, Folder 19",,,,,,,,,,,English,"Mass cards",Ms2008_020_April162007Archives_B348_F19_C02096_Card_Undated,"Researchers wishing to cite this collection should include the following information: Virginia Tech April 16, 2007 Archives of the University Libraries, Ms2008-020, Special Collections and University Archives, Virginia Tech, Blacksburg, Va.",,,,,,,,,,,,"Special Collections and University Archives, Virginia Tech",,,,,,,,,,,,,,,,,,,,,,,,,,,,,,,,,,,,PDF,,,,,,,,,,,,,,,,,,,,,,,,,,,,,,,,,,,https://digitalsc.lib.vt.edu/files/original/a876287d62df0ab0a839de56e74d484d.pdf,Document,"Virginia Tech April 16, 2007 Archives of the University Libraries (MS2008-020)",1,0
3265,https://digitalsc.lib.vt.edu/items/show/3265,"Sherwood Anderson Correspondence with Llewellyn Jones, 1916-1924, n.d. (Ms2015-044)",,"Authors, American--20th Century^^Correspondence^^Anderson, Sherwood, 1876-1941","Letter, Sherwood Anderson to Llewellyn Jonesm, undated [likely 1922 or 1923]",,,"Anderson, Sherwood, 1876-1947","<a href=""http://ead.lib.virginia.edu/vivaxtf/view?docId=vt/viblbv01807.xml"">See the Finding Aid for the Sherwood Anderson Correspondence with Llewellyn Jones</a>",,undated,,,,,,,,,,"<a href=""https://omeka.lib.vt.edu/files/thumbnails/spec_forms/PubPermission.doc"">Permission to publish material from the the Sherwood Anderson Correspondence with Llewellyn Jones must be obtained from Special Collections, Virginia Tech.</a>",,,,,,,,,,,,,,,,,,,,,,Ms2015-044_AndersonSherwood_Letter_1922or1923,"Researchers wishing to cite this collection should include the following information: Sherwood Anderson Correspondence with Llewellyn Jones, Ms2015-044, Special Collections, Virginia Tech, Blacksburg, Va.",,,,,,,,,,,,"<a href=""http://spec.lib.vt.edu/"" target=""_blank"">Special Collections, University Libraries, Virginia Tech</a>",,,,,,,,,,,,,,,,,,,,,,,,,,,,,,,,,,,,,,,,,,,,,,,,,,,,,,,,,,,,,,,,,,,,,,,https://digitalsc.lib.vt.edu/files/original/Sherwood_Anderson_Correspondence_with_Llewellyn_Jones._1916-1924_n.d._[Ms2015-044]/Ms2015-044/Ms2015-044_AndersonSherwood_Letter_1922or1923.jpg,"Still Image","Sherwood Anderson Correspondence with Llewellyn Jones, 1916-1924, n.d. (Ms2015-044)",1,0
3261,https://digitalsc.lib.vt.edu/items/show/3261,"Sherwood Anderson Correspondence with Llewellyn Jones, 1916-1924, n.d. (Ms2015-044)",,"Authors, American--20th Century^^Correspondence^^Anderson, Sherwood, 1876-1941","Letter, Sherwood Anderson to Llewellyn Jones, undated [likely 1917]",,,"Anderson, Sherwood, 1876-1943","<a href=""http://ead.lib.virginia.edu/vivaxtf/view?docId=vt/viblbv01807.xml"">See the Finding Aid for the Sherwood Anderson Correspondence with Llewellyn Jones</a>",,undated,,,,,,,,,,"<a href=""https://omeka.lib.vt.edu/files/thumbnails/spec_forms/PubPermission.doc"">Permission to publish material from the the Sherwood Anderson Correspondence with Llewellyn Jones must be obtained from Special Collections, Virginia Tech.</a>",,,,,,,,,,,,,,,,,,,,,,Ms2015-044_AndersonSherwood_Letter_1917,"Researchers wishing to cite this collection should include the following information: Sherwood Anderson Correspondence with Llewellyn Jones, Ms2015-044, Special Collections, Virginia Tech, Blacksburg, Va.",,,,,,,,,,,,"<a href=""http://spec.lib.vt.edu/"" target=""_blank"">Special Collections, University Libraries, Virginia Tech</a>",,,,,,,,,,,,,,,,,,,,,,,,,,,,,,,,,,,,,,,,,,,,,,,,,,,,,,,,,,,,,,,,,,,,,,,https://digitalsc.lib.vt.edu/files/original/Sherwood_Anderson_Correspondence_with_Llewellyn_Jones._1916-1924_n.d._[Ms2015-044]/Ms2015-044/Ms2015-044_AndersonSherwood_Letter_1917.jpg,"Still Image","Sherwood Anderson Correspondence with Llewellyn Jones, 1916-1924, n.d. (Ms2015-044)",1,0
11143,https://digitalsc.lib.vt.edu/items/show/11143,"Letter Soliciting Support for an Amendment Limiting the Work of Women and Children (Ms1989-039)",,"Local/Regional History and Appalachian South^^Textile industry^^Correspondence^^Labor laws and legislation","A letter asking the mill to support an amendement that would change the way the work of women and children was limited in Virginia.",,,"Conway, L.B. Jr.","<a href=""https://ead.lib.virginia.edu/vivaxtf/view?docId=vt/viblbv00590.xml"">See the Finding Aid for the Fries Textile Plant Records</a> ",,N.D.,,,,,,,,,,"<a href=""https://omeka.lib.vt.edu/files/thumbnails/spec_forms/PubPermission.doc"">Permission to publish material from the Fries Textile Plant Records Collection must be obtained from Special Collections, Virginia Tech.</a>",,,,,,,,,,,,,,,,,,,,,Correspondence,Ms1989-039_26_022_001,"Researchers wishing to cite this collection should include the following information: Fries Textile Plant Records, Ms1989-039, Special Collections, Virginia Polytechnic Institute and State University, Blacksburg, Va.",,,,,,,,,,,,"<a href=""http://spec.lib.vt.edu/"" target=""_blank"" rel=""noreferrer noopener"">Special Collections, University Libraries, Virginia Tech</a>",,,,,,,,,,,,,,,,,,,,,,,,,,,,,,,,,,,,,,,,,,,,,,,,,,,,,,,,,,,,,,,,,,,,,,,https://digitalsc.lib.vt.edu/files/original/f61b65998a0afce7218fca89be973bce.jpg,Document,"Fries Textile Plant Records, 1900-1988 (Ms1989-039)",1,0
11136,https://digitalsc.lib.vt.edu/items/show/11136,"Bobbin Winder (Ms1989-039)",,"Local/Regional History and Appalachian South^^Textile industry^^Correspondence^^Textile machinery","An image of a bobbin winding machine sent to the Fries mill.",,,"Oswald Lever","<a href=""https://ead.lib.virginia.edu/vivaxtf/view?docId=vt/viblbv00590.xml"">See the Finding Aid for the Fries Textile Plant Records</a> ",,N.D.,,,,,,,,,,"<a href=""https://omeka.lib.vt.edu/files/thumbnails/spec_forms/PubPermission.doc"">Permission to publish material from the Fries Textile Plant Records Collection must be obtained from Special Collections, Virginia Tech.</a>",,,,,,,,,,,,,,,,,,,,,Drawings,Ms1989-039_26_19_001,"Researchers wishing to cite this collection should include the following information: Fries Textile Plant Records, Ms1989-039, Special Collections, Virginia Polytechnic Institute and State University, Blacksburg, Va.",,,,,,,,,,,,"<a href=""http://spec.lib.vt.edu/"" target=""_blank"" rel=""noreferrer noopener"">Special Collections, University Libraries, Virginia Tech</a>",,,,,,,,,,,,,,,,,,,,,,,,,,,,,,,,,,,,,,,,,,,,,,,,,,,,,,,,,,,,,,,,,,,,,,,https://digitalsc.lib.vt.edu/files/original/0948af59d9a3d4bae6bbbc0421377c7f.jpg,Document,"Fries Textile Plant Records, 1900-1988 (Ms1989-039)",1,0
11119,https://digitalsc.lib.vt.edu/items/show/11119,"A Letter to Washington Mills about Fabric Samples (Ms1989-039)",,"Local/Regional History and Appalachian South^^Correspondence^^Interior decoration","A letter from Mrs. Jack Epps asking for fabric samples to match her new wallpaper.",,,"Epps, Mrs. Jack","<a href=""https://ead.lib.virginia.edu/vivaxtf/view?docId=vt/viblbv00590.xml"">See the Finding Aid for the Fries Textile Plant Records</a> ",,N.D.,,,,,,,,,,"<a href=""https://omeka.lib.vt.edu/files/thumbnails/spec_forms/PubPermission.doc"">Permission to publish material from the Fries Textile Plant Records Collection must be obtained from Special Collections, Virginia Tech.</a>",,,,,,,,,,,,,,,,,,,,,Correspondence,Ms1989-039_23_086_001,"Researchers wishing to cite this collection should include the following information: Fries Textile Plant Records, Ms1989-039, Special Collections, Virginia Polytechnic Institute and State University, Blacksburg, Va.",,,,,,,,,,,,"<a href=""http://spec.lib.vt.edu/"" target=""_blank"" rel=""noreferrer noopener"">Special Collections, University Libraries, Virginia Tech</a>",,,,,,,,,,,,,,,,,,,,,,,,,,,,,,,,,,,,,,,,,,,,,,,,,,,,,,,,,,,,,,,,,,,,,,,https://digitalsc.lib.vt.edu/files/original/a7d26722ce66e1c7b77ffc843437a6db.jpg,Document,"Fries Textile Plant Records, 1900-1988 (Ms1989-039)",1,0
11110,https://digitalsc.lib.vt.edu/items/show/11110,"Bulletin Board Poster (Ms1989-039)",,"Local/Regional History and Appalachian South^^Accidents--Prevention^^Correspondence","A suggested template about workplace safety, sent to the Fries Textile Plant.",,,"Elliott Industrial Bulletin Board Displays","<a href=""https://ead.lib.virginia.edu/vivaxtf/view?docId=vt/viblbv00590.xml"">See the Finding Aid for the Fries Textile Plant Records</a> ",,N.D.,,,,,,,,,,"<a href=""https://omeka.lib.vt.edu/files/thumbnails/spec_forms/PubPermission.doc"">Permission to publish material from the Fries Textile Plant Records Collection must be obtained from Special Collections, Virginia Tech.</a>",,,,,,,,,,,,,,,,,,,,,Advertisements,Ms1989-039_04_064_001,"Researchers wishing to cite this collection should include the following information: Fries Textile Plant Records, Ms1989-039, Special Collections, Virginia Polytechnic Institute and State University, Blacksburg, Va.",,,,,,,,,,,,"<a href=""http://spec.lib.vt.edu/"" target=""_blank"" rel=""noreferrer noopener"">Special Collections, University Libraries, Virginia Tech</a>",,,,,,,,,,,,,,,,,,,,,,,,,,,,,,,,,,,,,,,,,,,,,,,,,,,,,,,,,,,,,,,,,,,,,,,https://digitalsc.lib.vt.edu/files/original/c34e071e2b4a7f7dca16270feb95ff68.jpg,Document,"Fries Textile Plant Records, 1900-1988 (Ms1989-039)",1,0
3260,https://digitalsc.lib.vt.edu/items/show/3260,"Sherwood Anderson Correspondence with Llewellyn Jones, 1916-1924, n.d. (Ms2015-044)",,"Authors, American--20th Century^^Correspondence^^Anderson, Sherwood, 1876-1941","Envelope, Sherwood Anderson to Llewellyn Jones, September 9, 1916",,,"Anderson, Sherwood, 1876-1944","<a href=""http://ead.lib.virginia.edu/vivaxtf/view?docId=vt/viblbv01807.xml"">See the Finding Aid for the Sherwood Anderson Correspondence with Llewellyn Jones</a>",,9/9/1916,,,,,,,,,,"<a href=""https://omeka.lib.vt.edu/files/thumbnails/spec_forms/PubPermission.doc"">Permission to publish material from the the Sherwood Anderson Correspondence with Llewellyn Jones must be obtained from Special Collections, Virginia Tech.</a>",,,,,,,,,,,,,,,,,,,,,,Ms2015-044_AndersonSherwood_Letter_1916_0909env,"Researchers wishing to cite this collection should include the following information: Sherwood Anderson Correspondence with Llewellyn Jones, Ms2015-044, Special Collections, Virginia Tech, Blacksburg, Va.",,,,,,,,,,,,"<a href=""http://spec.lib.vt.edu/"" target=""_blank"">Special Collections, University Libraries, Virginia Tech</a>",,,,,,,,,,,,,,,,,,,,,,,,,,,,,,,,,,,,,,,,,,,,,,,,,,,,,,,,,,,,,,,,,,,,,,,https://digitalsc.lib.vt.edu/files/original/Sherwood_Anderson_Correspondence_with_Llewellyn_Jones._1916-1924_n.d._[Ms2015-044]/Ms2015-044/Ms2015-044_AndersonSherwood_Letter_1916_0909env.jpg,"Still Image","Sherwood Anderson Correspondence with Llewellyn Jones, 1916-1924, n.d. (Ms2015-044)",1,0
3259,https://digitalsc.lib.vt.edu/items/show/3259,"Sherwood Anderson Correspondence with Llewellyn Jones, 1916-1924, n.d. (Ms2015-044)",,"Authors, American--20th Century^^Correspondence^^Anderson, Sherwood, 1876-1941","Letter, Sherwood Anderson to Llewellyn Jones, September 9, 1916",,,"Anderson, Sherwood, 1876-1943","<a href=""http://ead.lib.virginia.edu/vivaxtf/view?docId=vt/viblbv01807.xml"">See the Finding Aid for the Sherwood Anderson Correspondence with Llewellyn Jones</a>",,9/9/1916,,,,,,,,,,"<a href=""https://omeka.lib.vt.edu/files/thumbnails/spec_forms/PubPermission.doc"">Permission to publish material from the the Sherwood Anderson Correspondence with Llewellyn Jones must be obtained from Special Collections, Virginia Tech.</a>",,,,,,,,,,,,,,,,,,,,,,Ms2015-044_AndersonSherwood_Letter_1916_0909,"Researchers wishing to cite this collection should include the following information: Sherwood Anderson Correspondence with Llewellyn Jones, Ms2015-044, Special Collections, Virginia Tech, Blacksburg, Va.",,,,,,,,,,,,"<a href=""http://spec.lib.vt.edu/"" target=""_blank"">Special Collections, University Libraries, Virginia Tech</a>",,,,,,,,,,,,,,,,,,,,,,,,,,,,,,,,,,,,,,,,,,,,,,,,,,,,,,,,,,,,,,,,,,,,,,,https://digitalsc.lib.vt.edu/files/original/Sherwood_Anderson_Correspondence_with_Llewellyn_Jones._1916-1924_n.d._[Ms2015-044]/Ms2015-044/Ms2015-044_AndersonSherwood_Letter_1916_0909.jpg,"Still Image","Sherwood Anderson Correspondence with Llewellyn Jones, 1916-1924, n.d. (Ms2015-044)",1,0
3267,https://digitalsc.lib.vt.edu/items/show/3267,"Sherwood Anderson Correspondence with Llewellyn Jones, 1916-1924, n.d. (Ms2015-044)",,"Authors, American--20th Century^^Correspondence^^Anderson, Sherwood, 1876-1941","Envelope, Sherwood Anderson to Llewellyn Jones, July 22, 1924",,,"Anderson, Sherwood, 1876-1949","<a href=""http://ead.lib.virginia.edu/vivaxtf/view?docId=vt/viblbv01807.xml"">See the Finding Aid for the Sherwood Anderson Correspondence with Llewellyn Jones</a>",,7/22/1924,,,,,,,,,,"<a href=""https://omeka.lib.vt.edu/files/thumbnails/spec_forms/PubPermission.doc"">Permission to publish material from the the Sherwood Anderson Correspondence with Llewellyn Jones must be obtained from Special Collections, Virginia Tech.</a>",,,,,,,,,,,,,,,,,,,,,,Ms2015-044_AndersonSherwood_Letter_1924_0722env,"Researchers wishing to cite this collection should include the following information: Sherwood Anderson Correspondence with Llewellyn Jones, Ms2015-044, Special Collections, Virginia Tech, Blacksburg, Va.",,,,,,,,,,,,"<a href=""http://spec.lib.vt.edu/"" target=""_blank"">Special Collections, University Libraries, Virginia Tech</a>",,,,,,,,,,,,,,,,,,,,,,,,,,,,,,,,,,,,,,,,,,,,,,,,,,,,,,,,,,,,,,,,,,,,,,,https://digitalsc.lib.vt.edu/files/original/Sherwood_Anderson_Correspondence_with_Llewellyn_Jones._1916-1924_n.d._[Ms2015-044]/Ms2015-044/Ms2015-044_AndersonSherwood_Letter_1924_0722env.jpg,"Still Image","Sherwood Anderson Correspondence with Llewellyn Jones, 1916-1924, n.d. (Ms2015-044)",1,0
3266,https://digitalsc.lib.vt.edu/items/show/3266,"Sherwood Anderson Correspondence with Llewellyn Jones, 1916-1924, n.d. (Ms2015-044)",,"Authors, American--20th Century^^Correspondence^^Anderson, Sherwood, 1876-1941","Letter, Sherwood Anderson to Llewellyn Jones, July 22, 1924",,,"Anderson, Sherwood, 1876-1948","<a href=""http://ead.lib.virginia.edu/vivaxtf/view?docId=vt/viblbv01807.xml"">See the Finding Aid for the Sherwood Anderson Correspondence with Llewellyn Jones</a>",,7/22/1924,,,,,,,,,,"<a href=""https://omeka.lib.vt.edu/files/thumbnails/spec_forms/PubPermission.doc"">Permission to publish material from the the Sherwood Anderson Correspondence with Llewellyn Jones must be obtained from Special Collections, Virginia Tech.</a>",,,,,,,,,,,,,,,,,,,,,,Ms2015-044_AndersonSherwood_Letter_1924_0722,"Researchers wishing to cite this collection should include the following information: Sherwood Anderson Correspondence with Llewellyn Jones, Ms2015-044, Special Collections, Virginia Tech, Blacksburg, Va.",,,,,,,,,,,,"<a href=""http://spec.lib.vt.edu/"" target=""_blank"">Special Collections, University Libraries, Virginia Tech</a>",,,,,,,,,,,,,,,,,,,,,,,,,,,,,,,,,,,,,,,,,,,,,,,,,,,,,,,,,,,,,,,,,,,,,,,"https://digitalsc.lib.vt.edu/files/original/Sherwood_Anderson_Correspondence_with_Llewellyn_Jones._1916-1924_n.d._[Ms2015-044]/Ms2015-044/Ms2015-044_AndersonSherwood_Letter_1924_0722a.jpg,https://digitalsc.lib.vt.edu/files/original/Sherwood_Anderson_Correspondence_with_Llewellyn_Jones._1916-1924_n.d._[Ms2015-044]/Ms2015-044/Ms2015-044_AndersonSherwood_Letter_1924_0722b.jpg","Still Image","Sherwood Anderson Correspondence with Llewellyn Jones, 1916-1924, n.d. (Ms2015-044)",1,0
3258,https://digitalsc.lib.vt.edu/items/show/3258,"Sherwood Anderson Correspondence with Llewellyn Jones, 1916-1924, n.d. (Ms2015-044)",,"Authors, American--20th Century^^Correspondence^^Anderson, Sherwood, 1876-1941","Envelope, Sherwood Anderson to Llewellyn Jones, July 27, 1916",,,"Anderson, Sherwood, 1876-1942","<a href=""http://ead.lib.virginia.edu/vivaxtf/view?docId=vt/viblbv01807.xml"">See the Finding Aid for the Sherwood Anderson Correspondence with Llewellyn Jones</a>",,6/27/1916,,,,,,,,,,"<a href=""https://omeka.lib.vt.edu/files/thumbnails/spec_forms/PubPermission.doc"">Permission to publish material from the the Sherwood Anderson Correspondence with Llewellyn Jones must be obtained from Special Collections, Virginia Tech.</a>",,,,,,,,,,,,,,,,,,,,,,Ms2015-044_AndersonSherwood_Letter_1916_0727env,"Researchers wishing to cite this collection should include the following information: Sherwood Anderson Correspondence with Llewellyn Jones, Ms2015-044, Special Collections, Virginia Tech, Blacksburg, Va.",,,,,,,,,,,,"<a href=""http://spec.lib.vt.edu/"" target=""_blank"">Special Collections, University Libraries, Virginia Tech</a>",,,,,,,,,,,,,,,,,,,,,,,,,,,,,,,,,,,,,,,,,,,,,,,,,,,,,,,,,,,,,,,,,,,,,,,https://digitalsc.lib.vt.edu/files/original/Sherwood_Anderson_Correspondence_with_Llewellyn_Jones._1916-1924_n.d._[Ms2015-044]/Ms2015-044/Ms2015-044_AndersonSherwood_Letter_1916_0727env.jpg,"Still Image","Sherwood Anderson Correspondence with Llewellyn Jones, 1916-1924, n.d. (Ms2015-044)",1,0