﻿"Item Id","Item URI","Dublin Core:Title","Dublin Core:Alternative Title","Dublin Core:Subject","Dublin Core:Description","Dublin Core:Abstract","Dublin Core:Table Of Contents","Dublin Core:Creator","Dublin Core:Source","Dublin Core:Publisher","Dublin Core:Date","Dublin Core:Date Available","Dublin Core:Date Created","Dublin Core:Date Accepted","Dublin Core:Date Copyrighted","Dublin Core:Date Submitted","Dublin Core:Date Issued","Dublin Core:Date Modified","Dublin Core:Date Valid","Dublin Core:Contributor","Dublin Core:Rights","Dublin Core:Access Rights","Dublin Core:License","Dublin Core:Relation","Dublin Core:Conforms To","Dublin Core:Has Format","Dublin Core:Has Part","Dublin Core:Has Version","Dublin Core:Is Format Of","Dublin Core:Is Part Of","Dublin Core:Is Referenced By","Dublin Core:Is Replaced By","Dublin Core:Is Required By","Dublin Core:Is Version Of","Dublin Core:References","Dublin Core:Replaces","Dublin Core:Requires","Dublin Core:Format","Dublin Core:Extent","Dublin Core:Medium","Dublin Core:Language","Dublin Core:Type","Dublin Core:Identifier","Dublin Core:Bibliographic Citation","Dublin Core:Coverage","Dublin Core:Spatial Coverage","Dublin Core:Temporal Coverage","Dublin Core:Accrual Method","Dublin Core:Accrual Periodicity","Dublin Core:Accrual Policy","Dublin Core:Audience","Dublin Core:Audience Education Level","Dublin Core:Mediator","Dublin Core:Instructional Method","Dublin Core:Provenance","Dublin Core:Rights Holder","Item Type Metadata:Text","Item Type Metadata:Interviewer","Item Type Metadata:Interviewee","Item Type Metadata:Location","Item Type Metadata:Transcription","Item Type Metadata:Local URL","Item Type Metadata:Original Format","Item Type Metadata:Physical Dimensions","Item Type Metadata:Duration","Item Type Metadata:Compression","Item Type Metadata:Producer","Item Type Metadata:Director","Item Type Metadata:Bit Rate/Frequency","Item Type Metadata:Time Summary","Item Type Metadata:Email Body","Item Type Metadata:Subject Line","Item Type Metadata:From","Item Type Metadata:To","Item Type Metadata:CC","Item Type Metadata:BCC","Item Type Metadata:Number of Attachments","Item Type Metadata:Standards","Item Type Metadata:Objectives","Item Type Metadata:Materials","Item Type Metadata:Lesson Plan Text","Item Type Metadata:URL","Item Type Metadata:Event Type","Item Type Metadata:Participants","Item Type Metadata:Birth Date","Item Type Metadata:Birthplace","Item Type Metadata:Death Date","Item Type Metadata:Occupation","Item Type Metadata:Biographical Text","Item Type Metadata:Bibliography","Item Type Metadata:Transcript","Item Type Metadata:Viewer","Item Type Metadata:Narrator","Item Type Metadata:Production Team","Item Type Metadata:Display Resolution","Item Type Metadata:Frame Rate","Item Type Metadata:Player","Omeka Legacy File:Additional Creator","Omeka Legacy File:Transcriber","Omeka Legacy File:Producer","Omeka Legacy File:Render Device","Omeka Legacy File:Render Details","Omeka Legacy File:Capture Date","Omeka Legacy File:Capture Device","Omeka Legacy File:Capture Details","Omeka Legacy File:Change History","Omeka Legacy File:Watermark","Omeka Legacy File:Encryption","Omeka Legacy File:Compression","Omeka Legacy File:Post Processing","Omeka Image File:Width","Omeka Image File:Height","Omeka Image File:Bit Depth","Omeka Image File:Channels","Omeka Image File:Exif String","Omeka Image File:Exif Array","Omeka Image File:IPTC String","Omeka Image File:IPTC Array","Omeka Video File:Bitrate","Omeka Video File:Duration","Omeka Video File:Sample Rate","Omeka Video File:Codec","Omeka Video File:Width","Omeka Video File:Height","PDF Text:Text",tags,file,itemType,collection,public,featured
21589,https://digitalsc.lib.vt.edu/items/show/21589,"Virginia Agricultural and Mechanical College: Its History and Organization",,"University History^^Virginia Agricultural and Mechanical College","A book describing the history of Virginia Agricultural and Mechanical College, including its formation as a land grant university and its proposed education model.",,,,,"Richmond, Virginia: Supt. of Public Print",1872,,,,,,,,,,"<a href=""https://omeka.lib.vt.edu/files/thumbnails/spec_forms/PubPermission.doc"">Permission to publish material must be obtained from Special Collections, Virginia Tech.</a>",,,,,,,,,,,,,,,,,,,,English,Books,Ms2022_089_vamc_history_and_organization.,"Researchers wishing to cite this collection should include the following information: [item name], Sesquicentennial Time Capsule Collection (Ms2022-089), Special Collections, Virginia Polytechnic Institute and State University, Blacksburg, Va.",,,,,,,,,,,,"<a href=""http://spec.lib.vt.edu/"" target=""_blank"" rel=""noreferrer noopener"">Special Collections, University Libraries, Virginia Tech</a>",,,,,,,,,,,,,,,,,,,,,,,,,,,,,,,,,,,,PDF,,,,,,,,,,,,,,,,,,,,,,,,,,,,,,,,,,,https://digitalsc.lib.vt.edu/files/original/1983b0f0683ef8e7321476ebb4ac5d8f.pdf,Document,"Sesquicentennial Time Capsule Collection (Ms2022-089)",1,0
17527,https://digitalsc.lib.vt.edu/items/show/17527,"Dissertation, ""On The Stochastic Phage Attachment to Bacteria in Suspension,"" 1967-03",,"University History^^University Archives^^Virginia Polytechnic Institute","Cover page of the dissertation by Monica L. Chang for a Doctorate of Philosophy in Statistics. Chang is the first known Asian American woman to earn a doctorate from Virginia Tech, March 1, 1967.",,,,"<a href=""https://catalog.lib.vt.edu/cgi-bin/koha/opac-detail.pl?biblionumber=1130471"" target=""_blank"" rel=""noreferrer noopener"">See the catalog record for the <i>On the stochastic phage attachment to bacteria in suspension</i> by Monica Liu Chang.</a>",,1967-03-01,,,,,,,,,,"The copyright and related rights status of this Item has not been evaluated. Please contact Special Collections and University Archives for more information. You are free to use this Item in any way that is permitted by the copyright and related rights legislation that applies to your use. <a target=""_blank"" href=""http://rightsstatements.org/vocab/CNE/1.0/"" rel=""noreferrer noopener"">http://rightsstatements.org/vocab/CNE/1.0/</a>",,,,,,,,,"Dissertations and theses, LD5655.V853",,,,,,,,image/jpg,,,English,Books,LD5655_V856_1967_C38_ChangMonicaLiu_OnTheStochasticPhageAttachment..._1967_titlepage,"Chang, Monica Liu. ""On the stochastic phage attachment to bacteria in suspension,"" [title page]. Ph.D. diss. Virginia Polytechnic Instiute, 1967.",,,,,,,,,,,,"Special Collections and University Archives, Virginia Tech",,,,,,,,,,,,,,,,,,,,,,,,,,,,,,,,,,,,,,,,,,,,,,,,,,,,,,,,,,,,,,,,,,,,,,,https://digitalsc.lib.vt.edu/files/original/42402c5c44811f6d8f51757c5c673674.jpg,"Still Image","150th Anniversary of Virginia Tech Collection",1,0
7000,https://digitalsc.lib.vt.edu/items/show/7000,"Drink mixer [activity card] / compliments of Nat M. Leff, boxing promoter . . .",,"Cocktails--History^^History of Food and Drink","	A rare piece of Prohibition-era cocktailiana, presenting recipes for 72 concoctions listed alphabetically from Alexander to Woodstock, in a""slide rule format. This piece was distributed ""compliments of Nat M. Leff, Boxing Promoter, boxers furnished for entertainments, smoker, etc., twenty-four hour service."" 1932 calendar on verso.",,,,,"[New York] : Nat M. Leff, ( New York : E. K. Madan)","[ca. 1931]",,,,,,,,,,,,,,,,,,,,,,,,,,,,,,English,Books,TX951_D73_1931z,,,,,,,,,,,,,,,,,,,,,,,,,,,,,,,,,,,,,,,,,,,,,,,,,,,,,,,,,,,,,,,,,,,,,,,,,,,,,,,,,,,,"https://digitalsc.lib.vt.edu/files/original/4b759e58cfc5994dcf986f96a7fdc66a.jpg,https://digitalsc.lib.vt.edu/files/original/d68ad763f5ffe321773d468ffc18ca79.jpg,https://digitalsc.lib.vt.edu/files/original/7536ece2fca366225d9682682ff61ebe.jpg","Still Image","History of Food & Drink Collection Rare Books & Publications",1,0
6951,https://digitalsc.lib.vt.edu/items/show/6951,"Dr. S. J. Sears' domestic receipt book",,"History of Food and Drink","16 pages",,,,"History of Food and Drink Collection, Special Collections, University Libraries, Virginia Tech","Tuthill, N.Y. : Samuel J. Sears",1868,,,,,,,,,,"In the public domain.",,,,,,,,,,,,,,,,,,,,English,Books,RM388_S42_1868,"Sears, Samuel J. Dr. S.j. Sears' Domestic Receipt Book. Samuel J. Sears, 1869.",,,,,,,,,,,,,,,,,,,,,,,,,,,,,,,,,,,,,,,,,,,,,,,,,,,,,,,,,,,,,,,,,,,,,,,,,,,,,,,,,,,https://digitalsc.lib.vt.edu/files/original/6c8f4590431a623d15cc1378e6578947.pdf,Document,"History of Food & Drink Collection Rare Books & Publications",1,0
4894,https://digitalsc.lib.vt.edu/items/show/4894,"Here’s How: A Handbook of Recipes of Spirituous and Non-Spirituous Drinks Gathered from Authoritative Sources",,"History of Food and Drink","39 pages",,,,"History of Food and Drink Collection, Special Collections, University Libraries, Virginia Tech",n.p.,c.1930s?,,,,,,,,,,"In the public domain.",,,,,,,,,,,,,,,,,,,,,Books,TX951H46_1900z,,,,,,,,,,,,,,,,,,,,,,,,,,,,,,,,,,,,,,,,,,,,,,,,,PDF,,,,,,,,,,,,,,,,,,,,,,,,,,,,,,,,,,,https://digitalsc.lib.vt.edu/files/original/55c6a772ae9d468998728e4a9f4088e3.pdf,Document,"History of Food & Drink Collection Rare Books & Publications",1,0
3895,https://digitalsc.lib.vt.edu/items/show/3895,"Good Housekeeping's Book of Menus, Recipes, and Household Discoveries",,"History of Food and Drink","253 pages",,,,"History of Food and Drink Collection, Special Collections, University Libraries, Virginia Tech","New York: Good Housekeeping",1922,,,,,,,,,,"In the public domain.",,,,,,,,,,,,,,,,,,,,,Books,TX715.G62_1922,,,,,,,,,,,,,,,,,,,,,,,,,,,,,,,,,,,,,,,,,,,,,,,,,PDF,,,,,,,,,,,,,,,,,,,,,,,,,,,,,,,,,,,https://digitalsc.lib.vt.edu/files/original/3895/TX715.G62_1922.pdf,Document,"History of Food & Drink Collection Rare Books & Publications",1,0
3894,https://digitalsc.lib.vt.edu/items/show/3894,"Twentieth Century Cook Book; An Up-to-date and Skillful Preparation on the Art of Cooking and Modern Candy Making Simplified",,"History of Food and Drink","182 pages",,,,"History of Food and Drink Collection, Special Collections, University Libraries, Virginia Tech","Chicago: Geographical Publishing Company",1921,,,,,,,,,,"In the public domain.",,,,,,,,,,,,,,,,,,,,,Books,TX715.T93_1921,,,,,,,,,,,,,,,,,,,,,,,,,,,,,,,,,,,,,,,,,,,,,,,,,PDF,,,,,,,,,,,,,,,,,,,,,,,,,,,,,,,,,,,https://digitalsc.lib.vt.edu/files/original/3894/TX715.T93_1921.pdf,Document,"History of Food & Drink Collection Rare Books & Publications",1,0
3893,https://digitalsc.lib.vt.edu/items/show/3893,"A Complete Course in Canning",,"History of Food and Drink|Food Technology and Production","272 pages",,,,"History of Food and Drink Collection, Special Collections, University Libraries, Virginia Tech","Baltimore: From the Press of the Canning Trade",1919,,,,,,,,,,"In the public domain.",,,,,,,,,,,,,,,,,,,,,Books,TX603.C65_1919,,,,,,,,,,,,,,,,,,,,,,,,,,,,,,,,,,,,,,,,,,,,,,,,,PDF,,,,,,,,,,,,,,,,,,,,,,,,,,,,,,,,,,,https://digitalsc.lib.vt.edu/files/original/3893/TX603.C65_1919.pdf,Document,"History of Food & Drink Collection Rare Books & Publications",1,0
3892,https://digitalsc.lib.vt.edu/items/show/3892,"Mary Jane's Book of Household Hints",,"History of Food and Drink","93 pages",,,,"History of Food and Drink Collection, Special Collections, University Libraries, Virginia Tech","Boston: Boston Traveler",1915,,,,,,,,,,"In the public domain.",,,,,,,,,,,,,,,,,,,,,Books,TX158.M3_1915,,,,,,,,,,,,,,,,,,,,,,,,,,,,,,,,,,,,,,,,,,,,,,,,,PDF,,,,,,,,,,,,,,,,,,,,,,,,,,,,,,,,,,,https://digitalsc.lib.vt.edu/files/original/3892/TX158.M3_1915.pdf,Document,"History of Food & Drink Collection Rare Books & Publications",1,0
3891,https://digitalsc.lib.vt.edu/items/show/3891,"French Cookery for American Homes: 634 Recipes of Simple and Easy Dishes",,"History of Food and Drink","280 pages",,,,"History of Food and Drink Collection, Special Collections, University Libraries, Virginia Tech","New York: A. Wessels",1901,,,,,,,,,,"In the public domain.",,,,,,,,,,,,,,,,,,,,,Books,TX719.F74_1901,,,,,,,,,,,,,,,,,,,,,,,,,,,,,,,,,,,,,,,,,,,,,,,,,PDF,,,,,,,,,,,,,,,,,,,,,,,,,,,,,,,,,,,https://digitalsc.lib.vt.edu/files/original/3891/TX719.F74_1901.pdf,Document,"History of Food & Drink Collection Rare Books & Publications",1,0
3890,https://digitalsc.lib.vt.edu/items/show/3890,"My Favorite Receipt",,"History of Food and Drink","123 pages",,,,"History of Food and Drink Collection, Special Collections, University Libraries, Virginia Tech","New York: Royal Baking Powder Co.",1895,,,,,,,,,,"In the public domain.",,,,,,,,,,,,,,,,,,,,,Books,TX715.M965_1895,,,,,,,,,,,,,,,,,,,,,,,,,,,,,,,,,,,,,,,,,,,,,,,,,PDF,,,,,,,,,,,,,,,,,,,,,,,,,,,,,,,,,,,https://digitalsc.lib.vt.edu/files/original/3890/TX715.M965_1895.pdf,Document,"History of Food & Drink Collection Rare Books & Publications",1,0
3889,https://digitalsc.lib.vt.edu/items/show/3889,"The Housekeeper's Helper; Furnishing the Very Best Help in all the Necessities, Intricacies, Emergencies, and Vexations that Puzzle a Housekeeper",,"History of Food and Drink","644 pages",,,,"History of Food and Drink Collection, Special Collections, University Libraries, Virginia Tech","New York: Union Publishing House",1892,,,,,,,,,,"In the public domain.",,,,,,,,,,,,,,,,,,,,,Books,TX145.H68_1892,,,,,,,,,,,,,,,,,,,,,,,,,,,,,,,,,,,,,,,,,,,,,,,,,PDF,,,,,,,,,,,,,,,,,,,,,,,,,,,,,,,,,,,https://digitalsc.lib.vt.edu/files/original/3889/TX145.H68_1892.pdf,Document,"History of Food & Drink Collection Rare Books & Publications",1,0
3888,https://digitalsc.lib.vt.edu/items/show/3888,"The Housekeeper's Helper; Furnishing the Very Best Help in all the Necessities, Intricacies, Emergencies, and Vexations that Puzzle a Housekeeper",,"History of Food and Drink","644 pages",,,,"History of Food and Drink Collection, Special Collections, University Libraries, Virginia Tech","New York: Edgewood Publishing Company",1892,,,,,,,,,,"In the public domain.",,,,,,,,,,,,,,,,,,,,,Books,TX145.H68_1892_C2,,,,,,,,,,,,,,,,,,,,,,,,,,,,,,,,,,,,,,,,,,,,,,,,,PDF,,,,,,,,,,,,,,,,,,,,,,,,,,,,,,,,,,,https://digitalsc.lib.vt.edu/files/original/3888/TX145.H68_1892_C2.pdf,Document,"History of Food & Drink Collection Rare Books & Publications",1,0
3887,https://digitalsc.lib.vt.edu/items/show/3887,"The Cosmopolitan Cook and Recipe Book: Containing Recipes for the Preparation of American, French, German, English, Irish, and Other National Dishes",,"History of Food and Drink","397 pages",,,,"History of Food and Drink Collection, Special Collections, University Libraries, Virginia Tech","Buffalo, NY?: Dingens Bros.?",1890,,,,,,,,,,"In the public domain.",,,,,,,,,,,,,,,,,,,,,Books,TX725.A1_C585_1890,,,,,,,,,,,,,,,,,,,,,,,,,,,,,,,,,,,,,,,,,,,,,,,,,PDF,,,,,,,,,,,,,,,,,,,,,,,,,,,,,,,,,,,https://digitalsc.lib.vt.edu/files/original/3887/TX725.A1_C585_1890.pdf,Document,"History of Food & Drink Collection Rare Books & Publications",1,0
3886,https://digitalsc.lib.vt.edu/items/show/3886,"Every-day Facts for Every-day Life: A Book for the Household",,"History of Food and Drink","412 pages",,,,"History of Food and Drink Collection, Special Collections, University Libraries, Virginia Tech","New York: Dodd and Mead",1875,,,,,,,,,,"In the public domain.",,,,,,,,,,,,,,,,,,,,,Books,TX153.E93_1875,,,,,,,,,,,,,,,,,,,,,,,,,,,,,,,,,,,,,,,,,,,,,,,,,PDF,,,,,,,,,,,,,,,,,,,,,,,,,,,,,,,,,,,https://digitalsc.lib.vt.edu/files/original/3886/TX153.E93_1875.pdf,Document,"History of Food & Drink Collection Rare Books & Publications",1,0
5540,https://digitalsc.lib.vt.edu/items/show/5540,"Healthful Hints to Young Mothers: Also to Invalids and the Aged...",,"History of Food and Drink","18 pages",,,"Woolrich and Company (Palmer, Mass.)","History of Food and Drink Collection, Special Collections, University Libraries, Virginia Tech","Palmer, Mass. : Published by Woolrich & Co.",1884,,,,,,,,,,"In the public domain.",,,,,,,,,,,,,,,,,,,,,Books,RJ61.W66_1884,"Woolrich and Company (Palmer, Mass.),  Healthful Hints to Young Mothers : Also to Invalids and the Aged . Palmer, Mass.: Published by Woolrich & Co., 1884.",,,,,,,,,,,,,,,,,,,,,,,,,,,,,,,,,,,,,,,,,,,,,,,,PDF,,,,,,,,,,,,,,,,,,,,,,,,,,,,,,,,,,,https://digitalsc.lib.vt.edu/files/original/0487fed901f05b2a19e881cacb26d00a.pdf,Document,"History of Food & Drink Collection Rare Books & Publications",1,0
4045,https://digitalsc.lib.vt.edu/items/show/4045,"The Microscopy of Vegetable Foods, with Special Reference to the Detection of Adulteration and the Diagnosis of Mixtures",,"History of Food and Drink","701 pages",,,"Winton, Andrew Lincoln|Moeller, Josef","History of Food and Drink Collection, Special Collections, University Libraries, Virginia Tech","New York: J. Wiley & Sons",1906,,,,,,,,,,"In the public domain.",,,,,,,,,,,,,,,,,,,,,Books,TX543.W7_1906,,,,,,,,,,,,,,,,,,,,,,,,,,,,,,,,,,,,,,,,,,,,,,,,,PDF,,,,,,,,,,,,,,,,,,,,,,,,,,,,,,,,,,,https://digitalsc.lib.vt.edu/files/original/4045/TX543.W7_1906.pdf,Document,"History of Food & Drink Collection Rare Books & Publications",1,0
4043,https://digitalsc.lib.vt.edu/items/show/4043,"The Domestic Encyclopaedia; or, A Dictionary of Facts and Useful Knowledge",,"History of Food and Drink","5 volumes",,,"Willich, A. F. M.","History of Food and Drink Collection, Special Collections, University Libraries, Virginia Tech","Philadelphia: W. Y. Birch and A. Small",1803,,,,,,,,,,"In the public domain.",,,,,,,,,,,,,,,,,,,,,Books,TX11.W54_1803,,,,,,,,,,,,,,,,,,,,,,,,,,,,,,,,,,,,,,,,,,,,,,,,,PDF,,,,,,,,,,,,,,,,,,,,,,,,,,,,,,,,,,,https://digitalsc.lib.vt.edu/files/original/4043/TX11.W54_1803.pdf,Document,"History of Food & Drink Collection Rare Books & Publications",1,0
4041,https://digitalsc.lib.vt.edu/items/show/4041,"The Chemistry of Cookery",,"History of Food and Drink","328 pages",,,"Williams, William Mattieu","History of Food and Drink Collection, Special Collections, University Libraries, Virginia Tech","New York: D. Appleton and Company",1896,,,,,,,,,,"In the public domain.",,,,,,,,,,,,,,,,,,,,,Books,TX651.W47_1896,,,,,,,,,,,,,,,,,,,,,,,,,,,,,,,,,,,,,,,,,,,,,,,,,PDF,,,,,,,,,,,,,,,,,,,,,,,,,,,,,,,,,,,https://digitalsc.lib.vt.edu/files/original/4041/TX651.W47_1896.pdf,Document,"History of Food & Drink Collection Rare Books & Publications",1,0
4038,https://digitalsc.lib.vt.edu/items/show/4038,"Elements of the Theory and Practice of Cookery; A Textbook of Household Science, for Use in Schools",,"History of Food and Drink","347 pages",,,"Williams, Mary E.|Fisher, Katharine Rolston","History of Food and Drink Collection, Special Collections, University Libraries, Virginia Tech","New York: The Macmillan Company",1913,,,,,,,,,,"In the public domain.",,,,,,,,,,,,,,,,,,,,,Books,TX663.W72,,,,,,,,,,,,,,,,,,,,,,,,,,,,,,,,,,,,,,,,,,,,,,,,,PDF,,,,,,,,,,,,,,,,,,,,,,,,,,,,,,,,,,,https://digitalsc.lib.vt.edu/files/original/4038/TX663.W72.pdf,Document,"History of Food & Drink Collection Rare Books & Publications",1,0
4037,https://digitalsc.lib.vt.edu/items/show/4037,"The Ladies' Complete Manual of Home Duties: A Book of the Household",,"History of Food and Drink","156 pages",,,"Williams, Henry T.|Johnson, S. O. (Sophia Orne)","History of Food and Drink Collection, Special Collections, University Libraries, Virginia Tech","New York: World Manufacturing Co.",1885,,,,,,,,,,"In the public domain.",,,,,,,,,,,,,,,,,,,,,Books,TX153.W54_1885,,,,,,,,,,,,,,,,,,,,,,,,,,,,,,,,,,,,,,,,,,,,,,,,,PDF,,,,,,,,,,,,,,,,,,,,,,,,,,,,,,,,,,,https://digitalsc.lib.vt.edu/files/original/4037/TX153.W54_1885.pdf,Document,"History of Food & Drink Collection Rare Books & Publications",1,0
4035,https://digitalsc.lib.vt.edu/items/show/4035,"Dietetics for High Schools",,"History of Food and Drink^^Ann Hertzler Children's Cookbooks and Nutrition Literature Collection","201 pages",,,"Willard, Florence^^Gillett, Lucy H.","History of Food and Drink Collection, Special Collections, University Libraries, Virginia Tech","New York: The Macmillan Company",1920,,,,,,,,,,"In the public domain.",,,,,,,,,,,,,,,,,,,,,Books,TX551.W6_1920,,,,,,,,,,,,,,,,,,,,,,,,,,,,,,,,,,,,,,,,,,,,,,,,,PDF,,,,,,,,,,,,,,,,,,,,,,,,,,,,,,,,,,,https://digitalsc.lib.vt.edu/files/original/4035/TX551.W6_1920.pdf,Document,"History of Food & Drink Collection Rare Books & Publications",1,0
4033,https://digitalsc.lib.vt.edu/items/show/4033,"Just How: A Key to the Cook-books",,"History of Food and Drink","311 pages",,,"Whitney, A.D.T. (Adeline Dutton Train)","History of Food and Drink Collection, Special Collections, University Libraries, Virginia Tech","Boston: Houghton, Osgood and Co.",1885,,,,,,,,,,"In the public domain.",,,,,,,,,,,,,,,,,,,,,Books,TX715.W55_1885,,,,,,,,,,,,,,,,,,,,,,,,,,,,,,,,,,,,,,,,,,,,,,,,,PDF,,,,,,,,,,,,,,,,,,,,,,,,,,,,,,,,,,,https://digitalsc.lib.vt.edu/files/original/4033/TX715.W55_1885.pdf,Document,"History of Food & Drink Collection Rare Books & Publications",1,0
4666,https://digitalsc.lib.vt.edu/items/show/4666,"Author's signature,&nbsp;<em>Delta Wedding</em> by Eudora Welty (1946).&nbsp;",,,,,,"Welty, Eudora, 1909-2001",,,1946,,,,,,,,,,,,,,,,,,,,,,,,,,,,,,,Books,PS2545_E6_D4_1946,,,,,,,,,,,,,,,,,,,,,,,,,,,,,,,,,,,,,,,,,,,,,,,,,,,,,,,,,,,,,,,,,,,,,,,,,,,,,,,,,,,,https://digitalsc.lib.vt.edu/files/original/4666/PS3545E6D41946.jpg,Document,"Printed Materials
",1,0
4032,https://digitalsc.lib.vt.edu/items/show/4032,"The Pastrycook and Confectioner's Guide: For Hotels, Restaurants, and the Trade in General, Adapted also for Family Use",,"History of Food and Drink","108 pages",,,"Wells, Robert","History of Food and Drink Collection, Special Collections, University Libraries, Virginia Tech","London: Crosby Lockwood and Son",1889,,,,,,,,,,"In the public domain.",,,,,,,,,,,,,,,,,,,,,Books,TX773.W4457_1889,,,,,,,,,,,,,,,,,,,,,,,,,,,,,,,,,,,,,,,,,,,,,,,,,PDF,,,,,,,,,,,,,,,,,,,,,,,,,,,,,,,,,,,https://digitalsc.lib.vt.edu/files/original/4032/TX773.W4457_1889.pdf,Document,"History of Food & Drink Collection Rare Books & Publications",1,0
4030,https://digitalsc.lib.vt.edu/items/show/4030,"The Improved Housewife, or Book of Receipts",,"History of Food and Drink","238 pages",,,"Webster, A. L., Mrs.","History of Food and Drink Collection, Special Collections, University Libraries, Virginia Tech","Hartford, CT",1847,,,,,,,,,,"In the public domain.",,,,,,,,,,,,,,,,,,,,,Books,TX715.W383_1847,,,,,,,,,,,,,,,,,,,,,,,,,,,,,,,,,,,,,,,,,,,,,,,,,PDF,,,,,,,,,,,,,,,,,,,,,,,,,,,,,,,,,,,https://digitalsc.lib.vt.edu/files/original/4030/TX715.W383_1847.pdf,Document,"History of Food & Drink Collection Rare Books & Publications",1,0
4027,https://digitalsc.lib.vt.edu/items/show/4027,"The Grocer's Encyclopedia",,"History of Food and Drink","748 pages",,,"Ward, Artemas","History of Food and Drink Collection, Special Collections, University Libraries, Virginia Tech","New York",1911,,,,,,,,,,"In the public domain.",,,,,,,,,,,,,,,,,,,,,Books,TX349.W32,,,,,,,,,,,,,,,,,,,,,,,,,,,,,,,,,,,,,,,,,,,,,,,,,PDF,,,,,,,,,,,,,,,,,,,,,,,,,,,,,,,,,,,https://digitalsc.lib.vt.edu/files/original/4027/TX349.W32.pdf,Document,"History of Food & Drink Collection Rare Books & Publications",1,0