﻿"Item Id","Item URI","Dublin Core:Title","Dublin Core:Alternative Title","Dublin Core:Subject","Dublin Core:Description","Dublin Core:Abstract","Dublin Core:Table Of Contents","Dublin Core:Creator","Dublin Core:Source","Dublin Core:Publisher","Dublin Core:Date","Dublin Core:Date Available","Dublin Core:Date Created","Dublin Core:Date Accepted","Dublin Core:Date Copyrighted","Dublin Core:Date Submitted","Dublin Core:Date Issued","Dublin Core:Date Modified","Dublin Core:Date Valid","Dublin Core:Contributor","Dublin Core:Rights","Dublin Core:Access Rights","Dublin Core:License","Dublin Core:Relation","Dublin Core:Conforms To","Dublin Core:Has Format","Dublin Core:Has Part","Dublin Core:Has Version","Dublin Core:Is Format Of","Dublin Core:Is Part Of","Dublin Core:Is Referenced By","Dublin Core:Is Replaced By","Dublin Core:Is Required By","Dublin Core:Is Version Of","Dublin Core:References","Dublin Core:Replaces","Dublin Core:Requires","Dublin Core:Format","Dublin Core:Extent","Dublin Core:Medium","Dublin Core:Language","Dublin Core:Type","Dublin Core:Identifier","Dublin Core:Bibliographic Citation","Dublin Core:Coverage","Dublin Core:Spatial Coverage","Dublin Core:Temporal Coverage","Dublin Core:Accrual Method","Dublin Core:Accrual Periodicity","Dublin Core:Accrual Policy","Dublin Core:Audience","Dublin Core:Audience Education Level","Dublin Core:Mediator","Dublin Core:Instructional Method","Dublin Core:Provenance","Dublin Core:Rights Holder","Item Type Metadata:Text","Item Type Metadata:Interviewer","Item Type Metadata:Interviewee","Item Type Metadata:Location","Item Type Metadata:Transcription","Item Type Metadata:Local URL","Item Type Metadata:Original Format","Item Type Metadata:Physical Dimensions","Item Type Metadata:Duration","Item Type Metadata:Compression","Item Type Metadata:Producer","Item Type Metadata:Director","Item Type Metadata:Bit Rate/Frequency","Item Type Metadata:Time Summary","Item Type Metadata:Email Body","Item Type Metadata:Subject Line","Item Type Metadata:From","Item Type Metadata:To","Item Type Metadata:CC","Item Type Metadata:BCC","Item Type Metadata:Number of Attachments","Item Type Metadata:Standards","Item Type Metadata:Objectives","Item Type Metadata:Materials","Item Type Metadata:Lesson Plan Text","Item Type Metadata:URL","Item Type Metadata:Event Type","Item Type Metadata:Participants","Item Type Metadata:Birth Date","Item Type Metadata:Birthplace","Item Type Metadata:Death Date","Item Type Metadata:Occupation","Item Type Metadata:Biographical Text","Item Type Metadata:Bibliography","Item Type Metadata:Transcript","Item Type Metadata:Viewer","Item Type Metadata:Narrator","Item Type Metadata:Production Team","Item Type Metadata:Display Resolution","Item Type Metadata:Frame Rate","Item Type Metadata:Player","Omeka Legacy File:Additional Creator","Omeka Legacy File:Transcriber","Omeka Legacy File:Producer","Omeka Legacy File:Render Device","Omeka Legacy File:Render Details","Omeka Legacy File:Capture Date","Omeka Legacy File:Capture Device","Omeka Legacy File:Capture Details","Omeka Legacy File:Change History","Omeka Legacy File:Watermark","Omeka Legacy File:Encryption","Omeka Legacy File:Compression","Omeka Legacy File:Post Processing","Omeka Image File:Width","Omeka Image File:Height","Omeka Image File:Bit Depth","Omeka Image File:Channels","Omeka Image File:Exif String","Omeka Image File:Exif Array","Omeka Image File:IPTC String","Omeka Image File:IPTC Array","Omeka Video File:Bitrate","Omeka Video File:Duration","Omeka Video File:Sample Rate","Omeka Video File:Codec","Omeka Video File:Width","Omeka Video File:Height","PDF Text:Text",tags,file,itemType,collection,public,featured
8588,https://digitalsc.lib.vt.edu/items/show/8588,"NBSE, pg 179",,"University History",,,,,,,,,,,,,,,,,"Permission to publish material from the Virginia Tech Black History Collection must be obtained from Special Collections, Virginia Tech.",,,,,,,,,,,,,,,,,,,,,Clippings,Bugle_pg179_NSBE,,,,,,,,,,,,,,,,,,,,,,,,,,,,,,,,,,,,,,,,,,,,,,,,,,,,,,,,,,,,,,,,,,,,,,,,,,,,,,,,,,,,http://spec.lib.vt.edu/pickup/Omeka_upload/Bugle_pg179_NSBE.jpg,Document,"Black History at Virginia Tech - Black Organizations",1,0
8589,https://digitalsc.lib.vt.edu/items/show/8589,"Black Male Coalition, 1994",,"University History",,,,,,,1994,,,,,,,,,,"Permission to publish material from the Virginia Tech Black History Collection must be obtained from Special Collections, Virginia Tech.",,,,,,,,,,,,,,,,,,,,,Clippings,BlackMaleCoalition_1994,,,,,,,,,,,,,,,,,,,,,,,,,,,,,,,,,,,,,,,,,,,,,,,,,,,,,,,,,,,,,,,,,,,,,,,,,,,,,,,,,,,,http://spec.lib.vt.edu/pickup/Omeka_upload/BlackMaleCoalition_1994.jpg,Document,"Black History at Virginia Tech - Black Organizations",1,0
8590,https://digitalsc.lib.vt.edu/items/show/8590,"Black Graduate Student Organization, 1995",,"University History",,,,,,,1995,,,,,,,,,,"Permission to publish material from the Virginia Tech Black History Collection must be obtained from Special Collections, Virginia Tech.",,,,,,,,,,,,,,,,,,,,,Clippings,BlackGraduateStudentOrganization_1995,,,,,,,,,,,,,,,,,,,,,,,,,,,,,,,,,,,,,,,,,,,,,,,,,,,,,,,,,,,,,,,,,,,,,,,,,,,,,,,,,,,,http://spec.lib.vt.edu/pickup/Omeka_upload/BlackGraduateStudentOrganization_1995.jpg,Document,"Black History at Virginia Tech - Black Organizations",1,0
8591,https://digitalsc.lib.vt.edu/items/show/8591,"Alpha Phi Alpha, 1984",,"University History",,,,,,,1984,,,,,,,,,,"Permission to publish material from the Virginia Tech Black History Collection must be obtained from Special Collections, Virginia Tech.",,,,,,,,,,,,,,,,,,,,,Clippings,AlphaPhiAlpha_1984,,,,,,,,,,,,,,,,,,,,,,,,,,,,,,,,,,,,,,,,,,,,,,,,,,,,,,,,,,,,,,,,,,,,,,,,,,,,,,,,,,,,http://spec.lib.vt.edu/pickup/Omeka_upload/AlphaPhiAlpha_1984.jpg,Document,"Black History at Virginia Tech - Black Organizations",1,0
8592,https://digitalsc.lib.vt.edu/items/show/8592,"Alpha Phi Alpha, 1982",,"University History",,,,,,,1982,,,,,,,,,,"Permission to publish material from the Virginia Tech Black History Collection must be obtained from Special Collections, Virginia Tech.",,,,,,,,,,,,,,,,,,,,,Clippings,AlphaPhiAlpha_1982,,,,,,,,,,,,,,,,,,,,,,,,,,,,,,,,,,,,,,,,,,,,,,,,,,,,,,,,,,,,,,,,,,,,,,,,,,,,,,,,,,,,http://spec.lib.vt.edu/pickup/Omeka_upload/AlphaPhiAlpha_1982.jpg,Document,"Black History at Virginia Tech - Black Organizations",1,0
8593,https://digitalsc.lib.vt.edu/items/show/8593,"Alpha Phi Alpha, 1979",,"University History",,,,,,,1979,,,,,,,,,,"Permission to publish material from the Virginia Tech Black History Collection must be obtained from Special Collections, Virginia Tech.",,,,,,,,,,,,,,,,,,,,,Clippings,AlphaPhiAlpha_1979,,,,,,,,,,,,,,,,,,,,,,,,,,,,,,,,,,,,,,,,,,,,,,,,,,,,,,,,,,,,,,,,,,,,,,,,,,,,,,,,,,,,http://spec.lib.vt.edu/pickup/Omeka_upload/AlphaPhiAlpha_1979.jpg,Document,"Black History at Virginia Tech - Black Organizations",1,0
8594,https://digitalsc.lib.vt.edu/items/show/8594,"Alpha Phi Alpha, 1977",,"University History",,,,,,,1977,,,,,,,,,,"Permission to publish material from the Virginia Tech Black History Collection must be obtained from Special Collections, Virginia Tech.",,,,,,,,,,,,,,,,,,,,,Clippings,AlphaPhiAlpha_1977,,,,,,,,,,,,,,,,,,,,,,,,,,,,,,,,,,,,,,,,,,,,,,,,,,,,,,,,,,,,,,,,,,,,,,,,,,,,,,,,,,,,http://spec.lib.vt.edu/pickup/Omeka_upload/AlphaPhiAlpha_1977.jpg,Document,"Black History at Virginia Tech - Black Organizations",1,0
8595,https://digitalsc.lib.vt.edu/items/show/8595,"Alpha Phi Alpha, 1976",,"University History",,,,,,,1976,,,,,,,,,,"Permission to publish material from the Virginia Tech Black History Collection must be obtained from Special Collections, Virginia Tech.",,,,,,,,,,,,,,,,,,,,,Clippings,AlphaPhiAlpha_1976,,,,,,,,,,,,,,,,,,,,,,,,,,,,,,,,,,,,,,,,,,,,,,,,,,,,,,,,,,,,,,,,,,,,,,,,,,,,,,,,,,,,http://spec.lib.vt.edu/pickup/Omeka_upload/AlphaPhiAlpha_1976.jpg,Document,"Black History at Virginia Tech - Black Organizations",1,0
8596,https://digitalsc.lib.vt.edu/items/show/8596,"Alpha Phi Alpha, Jefferson National Park, 1975",,"University History",,,,,,,1975,,,,,,,,,,"Permission to publish material from the Virginia Tech Black History Collection must be obtained from Special Collections, Virginia Tech.",,,,,,,,,,,,,,,,,,,,,Clippings,AlphaPhiAlpha_1975_JeffersonNationalPark,,,,,,,,,,,,,,,,,,,,,,,,,,,,,,,,,,,,,,,,,,,,,,,,,,,,,,,,,,,,,,,,,,,,,,,,,,,,,,,,,,,,http://spec.lib.vt.edu/pickup/Omeka_upload/AlphaPhiAlpha_1975_JeffersonNationalPark.jpg,Document,"Black History at Virginia Tech - Black Organizations",1,0
8597,https://digitalsc.lib.vt.edu/items/show/8597,"Alpha Kappa Alpha, 1982",,"University History",,,,,,,1982,,,,,,,,,,"Permission to publish material from the Virginia Tech Black History Collection must be obtained from Special Collections, Virginia Tech.",,,,,,,,,,,,,,,,,,,,,Clippings,AlphaKappaAlpha_1982,,,,,,,,,,,,,,,,,,,,,,,,,,,,,,,,,,,,,,,,,,,,,,,,,,,,,,,,,,,,,,,,,,,,,,,,,,,,,,,,,,,,http://spec.lib.vt.edu/pickup/Omeka_upload/AlphaKappaAlpha_1982.jpg,Document,"Black History at Virginia Tech - Black Organizations",1,0
8599,https://digitalsc.lib.vt.edu/items/show/8599,"Alpha Kappa Alpha, 1977",,"University History",,,,,,,1977,,,,,,,,,,"Permission to publish material from the Virginia Tech Black History Collection must be obtained from Special Collections, Virginia Tech.",,,,,,,,,,,,,,,,,,,,,Clippings,AlphaKappaAlpha_1977,,,,,,,,,,,,,,,,,,,,,,,,,,,,,,,,,,,,,,,,,,,,,,,,,,,,,,,,,,,,,,,,,,,,,,,,,,,,,,,,,,,,http://spec.lib.vt.edu/pickup/Omeka_upload/AlphaKappaAlpha_1977.jpg,Document,"Black History at Virginia Tech - Black Organizations",1,0
8600,https://digitalsc.lib.vt.edu/items/show/8600,"African Student Association, 1994",,"University History",,,,,,,1994,,,,,,,,,,"Permission to publish material from the Virginia Tech Black History Collection must be obtained from Special Collections, Virginia Tech.",,,,,,,,,,,,,,,,,,,,,Clippings,AfricanStudentAssociation_1994,,,,,,,,,,,,,,,,,,,,,,,,,,,,,,,,,,,,,,,,,,,,,,,,,,,,,,,,,,,,,,,,,,,,,,,,,,,,,,,,,,,,http://spec.lib.vt.edu/pickup/Omeka_upload/AfricanStudentAssociation_1994.jpg,Document,"Black History at Virginia Tech - Black Organizations",1,0
8601,https://digitalsc.lib.vt.edu/items/show/8601,"Kappa Alpha Psi, 1995",,"University History",,,,,,,1995,,,,,,,,,,"Permission to publish material from the Virginia Tech Black History Collection must be obtained from Special Collections, Virginia Tech.",,,,,,,,,,,,,,,,,,,,,Clippings,KappaAlphaPsi_1995,,,,,,,,,,,,,,,,,,,,,,,,,,,,,,,,,,,,,,,,,,,,,,,,,,,,,,,,,,,,,,,,,,,,,,,,,,,,,,,,,,,,https://digitalsc.lib.vt.edu/files/original/74a474c1f8b330b153c4848a9a799677.jpg,Document,"Black History at Virginia Tech - Black Organizations",1,0
9089,https://digitalsc.lib.vt.edu/items/show/9089,"Alpha Phi Alpha, the 1978 Bugle, pg 322",,"Univerity History",,,,,,,1978,,,,,,,,,,"Permission to publish material from the Virginia Tech Black History Collection must be obtained from Special Collections, Virginia Tech.",,,,,,,,,,,,,,,,,,,,,Clippings,1978_Bugle_pg322_AlphaPhiAlpha,,,,,,,,,,,,,,,,,,,,,,,,,,,,,,,,,,,,,,,,,,,,,,,,,,,,,,,,,,,,,,,,,,,,,,,,,,,,,,,,,,,,http://spec.lib.vt.edu/pickup/Omeka_upload/1978_Bugle_pg322_AlphaPhiAlpha.jpg,Document,"Black History at Virginia Tech - Black Organizations",1,0
9090,https://digitalsc.lib.vt.edu/items/show/9090,"Black Student Alliance, the 1979 Bugle, pg 268",,"Univerity History",,,,,,,1979,,,,,,,,,,"Permission to publish material from the Virginia Tech Black History Collection must be obtained from Special Collections, Virginia Tech.",,,,,,,,,,,,,,,,,,,,,Clippings,1979_Bugle_pg268_BSA,,,,,,,,,,,,,,,,,,,,,,,,,,,,,,,,,,,,,,,,,,,,,,,,,,,,,,,,,,,,,,,,,,,,,,,,,,,,,,,,,,,,http://spec.lib.vt.edu/pickup/Omeka_upload/1979_Bugle_pg268_BSA.jpg,Document,"Black History at Virginia Tech - Black Organizations",1,0
9091,https://digitalsc.lib.vt.edu/items/show/9091,"Alpha Kappa Alpha, the 1982 Bugle, pg 300",,"Univerity History",,,,,,,1982,,,,,,,,,,"Permission to publish material from the Virginia Tech Black History Collection must be obtained from Special Collections, Virginia Tech.",,,,,,,,,,,,,,,,,,,,,Clippings,AKA_1982Bugle_pg300,,,,,,,,,,,,,,,,,,,,,,,,,,,,,,,,,,,,,,,,,,,,,,,,,,,,,,,,,,,,,,,,,,,,,,,,,,,,,,,,,,,,http://spec.lib.vt.edu/pickup/Omeka_upload/AKA_1982Bugle_pg300.jpg,Document,"Black History at Virginia Tech - Black Organizations",1,0
9092,https://digitalsc.lib.vt.edu/items/show/9092,"Black Student Alliance, the 1983 Bugle, pg347",,"Univerity History",,,,,,,1983,,,,,,,,,,"Permission to publish material from the Virginia Tech Black History Collection must be obtained from Special Collections, Virginia Tech.",,,,,,,,,,,,,,,,,,,,,Clippings,BSA_1983Bugle_pg347,,,,,,,,,,,,,,,,,,,,,,,,,,,,,,,,,,,,,,,,,,,,,,,,,,,,,,,,,,,,,,,,,,,,,,,,,,,,,,,,,,,,http://spec.lib.vt.edu/pickup/Omeka_upload/BSA_1983Bugle_pg347.jpg,Document,"Black History at Virginia Tech - Black Organizations",1,0
9093,https://digitalsc.lib.vt.edu/items/show/9093,"Cultural Exchange 2, Alumni and Students",,"Univerity History",,,,,,,,,,,,,,,,,"Permission to publish material from the Virginia Tech Black History Collection must be obtained from Special Collections, Virginia Tech.",,,,,,,,,,,,,,,,,,,,,Photographs,CE2_AlumAndStudents,,,,,,,,,,,,,,,,,,,,,,,,,,,,,,,,,,,,,,,,,,,,,,,,,,,,,,,,,,,,,,,,,,,,,,,,,,,,,,,,,,,,http://spec.lib.vt.edu/pickup/Omeka_upload/CE2_AlumAndStudents.jpg,Document,"Black History at Virginia Tech - Black Organizations",1,0
9094,https://digitalsc.lib.vt.edu/items/show/9094,"Cultural Exchange 2, fun pic",,"Univerity History",,,,,,,,,,,,,,,,,"Permission to publish material from the Virginia Tech Black History Collection must be obtained from Special Collections, Virginia Tech.",,,,,,,,,,,,,,,,,,,,,Photographs,CE2_FunPic1,,,,,,,,,,,,,,,,,,,,,,,,,,,,,,,,,,,,,,,,,,,,,,,,,,,,,,,,,,,,,,,,,,,,,,,,,,,,,,,,,,,,http://spec.lib.vt.edu/pickup/Omeka_upload/CE2_FunPic1.jpg,Document,"Black History at Virginia Tech - Black Organizations",1,0
9095,https://digitalsc.lib.vt.edu/items/show/9095,"Florence Jackson, Black Organizations Council, the 1983 Bugle, pg 303",,"Univerity History",,,,,,,1983,,,,,,,,,,"Permission to publish material from the Virginia Tech Black History Collection must be obtained from Special Collections, Virginia Tech.",,,,,,,,,,,,,,,,,,,,,Clippings,JacksonFlorence_1983Bugle_pg303,,,,,,,,,,,,,,,,,,,,,,,,,,,,,,,,,,,,,,,,,,,,,,,,,,,,,,,,,,,,,,,,,,,,,,,,,,,,,,,,,,,,http://spec.lib.vt.edu/pickup/Omeka_upload/JacksonFlorence_1983Bugle_pg303.jpg,Document,"Black History at Virginia Tech - Black Organizations",1,0
9096,https://digitalsc.lib.vt.edu/items/show/9096,"NAACP, the 1983 Bugle, pg 346",,"Univerity History",,,,,,,1983,,,,,,,,,,"Permission to publish material from the Virginia Tech Black History Collection must be obtained from Special Collections, Virginia Tech.",,,,,,,,,,,,,,,,,,,,,Clippings,NAACP_1983Bugle_pg346,,,,,,,,,,,,,,,,,,,,,,,,,,,,,,,,,,,,,,,,,,,,,,,,,,,,,,,,,,,,,,,,,,,,,,,,,,,,,,,,,,,,http://spec.lib.vt.edu/pickup/Omeka_upload/NAACP_1983Bugle_pg346.jpg,Document,"Black History at Virginia Tech - Black Organizations",1,0
9097,https://digitalsc.lib.vt.edu/items/show/9097,"Darryl Settles and Gwen Gardner, the 1984 Bugle, pg 408",,"Univerity History",,,,,,,1984,,,,,,,,,,"Permission to publish material from the Virginia Tech Black History Collection must be obtained from Special Collections, Virginia Tech.",,,,,,,,,,,,,,,,,,,,,Clippings,SettlesDarryl_GardnerGwen_1984Bugle_pg408,,,,,,,,,,,,,,,,,,,,,,,,,,,,,,,,,,,,,,,,,,,,,,,,,,,,,,,,,,,,,,,,,,,,,,,,,,,,,,,,,,,,http://spec.lib.vt.edu/pickup/Omeka_upload/SettlesDarryl_GardnerGwen_1984Bugle_pg408.jpg,Document,"Black History at Virginia Tech - Black Organizations",1,0
9130,https://digitalsc.lib.vt.edu/items/show/9130,"Black Faculty/Staff Caucus of Virginia Tech Logo",,"University History",,,,,,,,,,,,,,,,,,,,,,,,,,,,,,,,,,,,,,,BFClogo,,,,,,,,,,,,,,,,,,,,,,,,,,,,,,,,,,,,,,,,,,,,,,,,,,,,,,,,,,,,,,,,,,,,,,,,,,,,,,,,,,,,"https://digitalsc.lib.vt.edu/files/original/c1f152c69de91f61c43a55ec66fb2cda.png,https://digitalsc.lib.vt.edu/files/original/9eb21cf282dbc62df2084cfea1b9d242.png,https://digitalsc.lib.vt.edu/files/original/eb2c6e68168b5ac3378f309ef3acc55b.png",,"Black History at Virginia Tech - Black Organizations",1,0
9160,https://digitalsc.lib.vt.edu/items/show/9160,"Homecoming Queen Candidate. The Bugle 1976, pg 444",Bugle1976_pg444_HumanRelations,,"Homecoming queen candidate put forward by human relations council. The Bugle 1976, pg 444",,,,,,1976,,,,,,,,,,"Permission to publish material from the Virginia Tech Black History Collection must be obtained from Special Collections, Virginia Tech.",,,,,,,,,,,,,,,,,,,,,,Bugle1976_pg444_HumanRelations,,,,,,,,,,,,,,,,,,,,,,,,,,,,,,,,,,,,,,,,,,,,,,,,,,,,,,,,,,,,,,,,,,,,,,,,,,,,,,,,,,,,https://digitalsc.lib.vt.edu/files/original/474ec59babbaa1660f7545f5adc9a358.jpg,,"Black History at Virginia Tech - Black Organizations",1,0
9186,https://digitalsc.lib.vt.edu/items/show/9186,"Monika Fikes in Black Cultural Center at Brian K. Roberts library","Monika Fikes_Brian Roberts Library","University History",,,,,,,"April 15, 2016",,,,,,,,,,"Permission to publish material from the Virginia Tech Black History Collection must be obtained from Special Collections, Virginia Tech.",,,,,,,,,,,,,,,,,,,,,,"Monika Fikes_Brian Roberts Library",,,,,,,,,,,,,,,,,,,,,,,,,,,,,,,,,,,,,,,,,,,,,,,,,,,,,,,,,,,,,,,,,,,,,,,,,,,,,,,,,,,,https://digitalsc.lib.vt.edu/files/original/2cc95ba847d83d54b3c4ce0d3a5ae2e2.jpg,,"Black History at Virginia Tech - Black Organizations",1,0
