﻿"Item Id","Item URI","Dublin Core:Title","Dublin Core:Alternative Title","Dublin Core:Subject","Dublin Core:Description","Dublin Core:Abstract","Dublin Core:Table Of Contents","Dublin Core:Creator","Dublin Core:Source","Dublin Core:Publisher","Dublin Core:Date","Dublin Core:Date Available","Dublin Core:Date Created","Dublin Core:Date Accepted","Dublin Core:Date Copyrighted","Dublin Core:Date Submitted","Dublin Core:Date Issued","Dublin Core:Date Modified","Dublin Core:Date Valid","Dublin Core:Contributor","Dublin Core:Rights","Dublin Core:Access Rights","Dublin Core:License","Dublin Core:Relation","Dublin Core:Conforms To","Dublin Core:Has Format","Dublin Core:Has Part","Dublin Core:Has Version","Dublin Core:Is Format Of","Dublin Core:Is Part Of","Dublin Core:Is Referenced By","Dublin Core:Is Replaced By","Dublin Core:Is Required By","Dublin Core:Is Version Of","Dublin Core:References","Dublin Core:Replaces","Dublin Core:Requires","Dublin Core:Format","Dublin Core:Extent","Dublin Core:Medium","Dublin Core:Language","Dublin Core:Type","Dublin Core:Identifier","Dublin Core:Bibliographic Citation","Dublin Core:Coverage","Dublin Core:Spatial Coverage","Dublin Core:Temporal Coverage","Dublin Core:Accrual Method","Dublin Core:Accrual Periodicity","Dublin Core:Accrual Policy","Dublin Core:Audience","Dublin Core:Audience Education Level","Dublin Core:Mediator","Dublin Core:Instructional Method","Dublin Core:Provenance","Dublin Core:Rights Holder","Item Type Metadata:Text","Item Type Metadata:Interviewer","Item Type Metadata:Interviewee","Item Type Metadata:Location","Item Type Metadata:Transcription","Item Type Metadata:Local URL","Item Type Metadata:Original Format","Item Type Metadata:Physical Dimensions","Item Type Metadata:Duration","Item Type Metadata:Compression","Item Type Metadata:Producer","Item Type Metadata:Director","Item Type Metadata:Bit Rate/Frequency","Item Type Metadata:Time Summary","Item Type Metadata:Email Body","Item Type Metadata:Subject Line","Item Type Metadata:From","Item Type Metadata:To","Item Type Metadata:CC","Item Type Metadata:BCC","Item Type Metadata:Number of Attachments","Item Type Metadata:Standards","Item Type Metadata:Objectives","Item Type Metadata:Materials","Item Type Metadata:Lesson Plan Text","Item Type Metadata:URL","Item Type Metadata:Event Type","Item Type Metadata:Participants","Item Type Metadata:Birth Date","Item Type Metadata:Birthplace","Item Type Metadata:Death Date","Item Type Metadata:Occupation","Item Type Metadata:Biographical Text","Item Type Metadata:Bibliography","Item Type Metadata:Transcript","Item Type Metadata:Viewer","Item Type Metadata:Narrator","Item Type Metadata:Production Team","Item Type Metadata:Display Resolution","Item Type Metadata:Frame Rate","Item Type Metadata:Player","Omeka Legacy File:Additional Creator","Omeka Legacy File:Transcriber","Omeka Legacy File:Producer","Omeka Legacy File:Render Device","Omeka Legacy File:Render Details","Omeka Legacy File:Capture Date","Omeka Legacy File:Capture Device","Omeka Legacy File:Capture Details","Omeka Legacy File:Change History","Omeka Legacy File:Watermark","Omeka Legacy File:Encryption","Omeka Legacy File:Compression","Omeka Legacy File:Post Processing","Omeka Image File:Width","Omeka Image File:Height","Omeka Image File:Bit Depth","Omeka Image File:Channels","Omeka Image File:Exif String","Omeka Image File:Exif Array","Omeka Image File:IPTC String","Omeka Image File:IPTC Array","Omeka Video File:Bitrate","Omeka Video File:Duration","Omeka Video File:Sample Rate","Omeka Video File:Codec","Omeka Video File:Width","Omeka Video File:Height","PDF Text:Text",tags,file,itemType,collection,public,featured
3939,https://digitalsc.lib.vt.edu/items/show/3939,"Emergency Helps for Housekeepers and Others",,"History of Food and Drink","231 pages",,,"Fleming, Mrs. Geo. W.","History of Food and Drink Collection, Special Collections, University Libraries, Virginia Tech","Lynchburg, VA: J. P. Bell, printers",1906,,,,,,,,,,"In the public domain.",,,,,,,,,,,,,,,,,,,,,Books,TX158.F53_1906,,,,,,,,,,,,,,,,,,,,,,,,,,,,,,,,,,,,,,,,,,,,,,,,,PDF,,,,,,,,,,,,,,,,,,,,,,,,,,,,,,,,,,,https://digitalsc.lib.vt.edu/files/original/3939/TX158.F53_1906.pdf,Document,"History of Food & Drink Collection Rare Books & Publications",1,0
3940,https://digitalsc.lib.vt.edu/items/show/3940,"Table Decorations and Delicacies: a Complete Hand-book for the Hostess",,"History of Food and Drink","121 pages",,,"Follett, Ida Lee Rust","History of Food and Drink Collection, Special Collections, University Libraries, Virginia Tech","Philadelphia: The John C. Winston Company",1914,,,,,,,,,,"In the public domain.",,,,,,,,,,,,,,,,,,,,,Books,TX871.F5_1914,,,,,,,,,,,,,,,,,,,,,,,,,,,,,,,,,,,,,,,,,,,,,,,,,PDF,,,,,,,,,,,,,,,,,,,,,,,,,,,,,,,,,,,https://digitalsc.lib.vt.edu/files/original/3940/TX871.F5_1914.pdf,Document,"History of Food & Drink Collection Rare Books & Publications",1,0
21419,https://digitalsc.lib.vt.edu/items/show/21419,"Burdock Blood Bitters: Almanac and Key to Health",,,"An almanac containing advertisements and testimonials for Burdock's Blood Bitters.",,,"Foster Milburn & Co.",,,?,,,,,,,,,,"In the public domain",,,,,,,,,"RM671.B87.M5 1888 Small Spec",,,,,,,,application/pdf,,,English,Pamphlets,RM671B87M51888,,,,,,,,,,,,,"Special Collections and University Archives, Virginia Tech",,,,,,,,,,,,,,,,,,,,,,,,,,,,,,,,,,,,PDF,,,,,,,,,,,,,,,,,,,,,,,,,,,,,,,,,,,https://digitalsc.lib.vt.edu/files/original/441561370d6d78cf576fedffdbcfb418.pdf,Document,"History of Food & Drink Collection Rare Books & Publications",1,0
3941,https://digitalsc.lib.vt.edu/items/show/3941,"A Manual of Dietetics",,"History of Food and Drink","255 pages",,,"Fothergill, J. Milner","History of Food and Drink Collection, Special Collections, University Libraries, Virginia Tech","New York: William Wood",1886,,,,,,,,,,"In the public domain.",,,,,,,,,,,,,,,,,,,,,Books,RM218.5.F67_1886,,,,,,,,,,,,,,,,,,,,,,,,,,,,,,,,,,,,,,,,,,,,,,,,,PDF,,,,,,,,,,,,,,,,,,,,,,,,,,,,,,,,,,,https://digitalsc.lib.vt.edu/files/original/3941/RM218.5.F67_1886.pdf,Document,"History of Food & Drink Collection Rare Books & Publications",1,0
3942,https://digitalsc.lib.vt.edu/items/show/3942,"Our New Cook Book and Household Receipts: Carefully Selected and Indexed",,"History of Food and Drink","454 pages",,,"Frost, S. Annie","History of Food and Drink Collection, Special Collections, University Libraries, Virginia Tech","Boston: People's Publishing Co.",1883,,,,,,,,,,"In the public domain.",,,,,,,,,,,,,,,,,,,,,Books,TX715.S541_1883,,,,,,,,,,,,,,,,,,,,,,,,,,,,,,,,,,,,,,,,,,,,,,,,,PDF,,,,,,,,,,,,,,,,,,,,,,,,,,,,,,,,,,,https://digitalsc.lib.vt.edu/files/original/3942/TX715.S541_1883.pdf,Document,"History of Food & Drink Collection Rare Books & Publications",1,0
3943,https://digitalsc.lib.vt.edu/items/show/3943,"The Grape Culturist: a Treatise on the Cultivation of the Native Grape",,"History of Food and Drink|Cocktail History","286 pages",,,"Fuller, Andrew S.","History of Food and Drink Collection, Special Collections, University Libraries, Virginia Tech","New York: O. Judd & Co.",1867,,,,,,,,,,"In the public domain.",,,,,,,,,,,,,,,,,,,,,Books,SB389.F96,,,,,,,,,,,,,,,,,,,,,,,,,,,,,,,,,,,,,,,,,,,,,,,,,PDF,,,,,,,,,,,,,,,,,,,,,,,,,,,,,,,,,,,https://digitalsc.lib.vt.edu/files/original/3943/SB389.F96.pdf,Document,"History of Food & Drink Collection Rare Books & Publications",1,0
3945,https://digitalsc.lib.vt.edu/items/show/3945,"The Cabinet Cook Book: Adapted from the White House Cook Book",,"History of Food and Drink","440 pages",,,"Gillette, F. L.","History of Food and Drink Collection, Special Collections, University Libraries, Virginia Tech","Springfield, MA: Phelps Pub. Co.",1901,,,,,,,,,,"In the public domain.",,,,,,,,,,,,,,,,,,,,,Books,TX715.G4818_1901,,,,,,,,,,,,,,,,,,,,,,,,,,,,,,,,,,,,,,,,,,,,,,,,,PDF,,,,,,,,,,,,,,,,,,,,,,,,,,,,,,,,,,,https://digitalsc.lib.vt.edu/files/original/3945/TX715.G4818_1901.pdf,Document,"History of Food & Drink Collection Rare Books & Publications",1,0
3944,https://digitalsc.lib.vt.edu/items/show/3944,"The Presidential Cookbook: adapted from the White House Cook Book",,"History of Food and Drink","440 pages",,,"Gillette, F. L. (Fanny Lemira)|Ziemann, Hugo","History of Food and Drink Collection, Special Collections, University Libraries, Virginia Tech","Akron, OH: Saalfield",1914,,,,,,,,,,"In the public domain.",,,,,,,,,,,,,,,,,,,,,Books,TX715.G486,,,,,,,,,,,,,,,,,,,,,,,,,,,,,,,,,,,,,,,,,,,,,,,,,PDF,,,,,,,,,,,,,,,,,,,,,,,,,,,,,,,,,,,https://digitalsc.lib.vt.edu/files/original/3944/TX715.G486.pdf,Document,"History of Food & Drink Collection Rare Books & Publications",1,0
3946,https://digitalsc.lib.vt.edu/items/show/3946,"The Household (of the Detroit Free Press): A Cyclopaedia of Practical Hints for Modern Homes",,"History of Food and Drink","644 pages",,,"Goff, May Perrin","History of Food and Drink Collection, Special Collections, University Libraries, Virginia Tech","Detroit: The Detroit Free Press Co.",1881,,,,,,,,,,"In the public domain.",,,,,,,,,,,,,,,,,,,,,Books,TX153.G63_1881,,,,,,,,,,,,,,,,,,,,,,,,,,,,,,,,,,,,,,,,,,,,,,,,,PDF,,,,,,,,,,,,,,,,,,,,,,,,,,,,,,,,,,,https://digitalsc.lib.vt.edu/files/original/3946/TX153.G63_1881.pdf,Document,"History of Food & Drink Collection Rare Books & Publications",1,0
3947,https://digitalsc.lib.vt.edu/items/show/3947,"The Dietetic Value of Bread",,"History of Food and Drink","328 pages",,,"Goodfellow, John","History of Food and Drink Collection, Special Collections, University Libraries, Virginia Tech","New York: Macmillan and Co.",1892,,,,,,,,,,"In the public domain.",,,,,,,,,,,,,,,,,,,,,Books,TX558.B7G66_1892,,,,,,,,,,,,,,,,,,,,,,,,,,,,,,,,,,,,,,,,,,,,,,,,,PDF,,,,,,,,,,,,,,,,,,,,,,,,,,,,,,,,,,,https://digitalsc.lib.vt.edu/files/original/3947/TX558.B7G66_1892.pdf,Document,"History of Food & Drink Collection Rare Books & Publications",1,0
3948,https://digitalsc.lib.vt.edu/items/show/3948,"A Text-book of Cooking",,"History of Food and Drink","431 pages",,,"Greer, Carlotta C.","History of Food and Drink Collection, Special Collections, University Libraries, Virginia Tech","Boston: Allyn and Bacon",1915,,,,,,,,,,"In the public domain.",,,,,,,,,,,,,,,,,,,,,Books,TX663.G7_1915,,,,,,,,,,,,,,,,,,,,,,,,,,,,,,,,,,,,,,,,,,,,,,,,,PDF,,,,,,,,,,,,,,,,,,,,,,,,,,,,,,,,,,,https://digitalsc.lib.vt.edu/files/original/3948/TX663.G7_1915.pdf,Document,"History of Food & Drink Collection Rare Books & Publications",1,0
3949,https://digitalsc.lib.vt.edu/items/show/3949,"School and Home Cooking",,"History of Food and Drink","530 pages",,,"Greer, Carlotta C.","History of Food and Drink Collection, Special Collections, University Libraries, Virginia Tech","Boston: Allyn and Bacon",1920,,,,,,,,,,"In the public domain.",,,,,,,,,,,,,,,,,,,,,Books,TX663.G65_1920,,,,,,,,,,,,,,,,,,,,,,,,,,,,,,,,,,,,,,,,,,,,,,,,,PDF,,,,,,,,,,,,,,,,,,,,,,,,,,,,,,,,,,,https://digitalsc.lib.vt.edu/files/original/3949/TX663.G65_1920.pdf,Document,"History of Food & Drink Collection Rare Books & Publications",1,0
3950,https://digitalsc.lib.vt.edu/items/show/3950,"Mrs. Hale's Receipts for the Million",,"History of Food and Drink","721 pages",,,"Hale, Sarah Josepha Buell","History of Food and Drink Collection, Special Collections, University Libraries, Virginia Tech","Philadelphia: T. B. Peterson",1857,,,,,,,,,,"In the public domain.",,,,,,,,,,,,,,,,,,,,,Books,TX153.H34_1857,,,,,,,,,,,,,,,,,,,,,,,,,,,,,,,,,,,,,,,,,,,,,,,,,PDF,,,,,,,,,,,,,,,,,,,,,,,,,,,,,,,,,,,https://digitalsc.lib.vt.edu/files/original/3950/TX153.H34_1857.pdf,Document,"History of Food & Drink Collection Rare Books & Publications",1,0
3951,https://digitalsc.lib.vt.edu/items/show/3951,"The Household Cyclopaedia of Practical Receipts and Daily Wants",,"History of Food and Drink","423 pages",,,"Hamilton, Alexander V.","History of Food and Drink Collection, Special Collections, University Libraries, Virginia Tech","Springfield, MA: W. J. Holland & Co.",1873,,,,,,,,,,"In the public domain.",,,,,,,,,,,,,,,,,,,,,Books,TX153.H22_1873,,,,,,,,,,,,,,,,,,,,,,,,,,,,,,,,,,,,,,,,,,,,,,,,,PDF,,,,,,,,,,,,,,,,,,,,,,,,,,,,,,,,,,,https://digitalsc.lib.vt.edu/files/original/3951/TX153.H22_1873.pdf,Document,"History of Food & Drink Collection Rare Books & Publications",1,0
21403,https://digitalsc.lib.vt.edu/items/show/21403,"Wizard Oil",,"History of Food and Drink^^Advertisements","An advertising pamphlet for ""Wizard Oil,"" to be used for sunburns, stiff and sore muscles, bruises, fleas, mites, chiggers, ticks, and skin abrasians. The booklet also contains information on practical care for a variety of injuries, from sprained ankles to nosebleeds.",,,"Hamlin's Wizard Oil Co.",,,1900,,,,,,,,,,"In the public domain",,,,,,,,,"RM 671 H36 H36 1900 Spec small",,,,,,,,application/pdf,,,English,Advertisements,RM671H36H361900,,,,,,,,,,,,,"Special Collections and University Archives, Virginia Tech",,,,,,,,,,,,,,,,,,,,,,,,,,,,,,,,,,,,PDF,,,,,,,,,,,,,,,,,,,,,,,,,,,,,,,,,,,https://digitalsc.lib.vt.edu/files/original/4bed2815e65b87f98a4ae6fda4ccbdf6.pdf,Document,"History of Food & Drink Collection Rare Books & Publications",1,0
3952,https://digitalsc.lib.vt.edu/items/show/3952,"Low Cost Recipes",,"History of Food and Drink","208 pages",,,"Harbison, Edith Gwendolyn","History of Food and Drink Collection, Special Collections, University Libraries, Virginia Tech","Philadelphia: G. W. Jacobs & Co.",1914,,,,,,,,,,"In the public domain.",,,,,,,,,,,,,,,,,,,,,Books,TX715.H257_1914,,,,,,,,,,,,,,,,,,,,,,,,,,,,,,,,,,,,,,,,,,,,,,,,,PDF,,,,,,,,,,,,,,,,,,,,,,,,,,,,,,,,,,,https://digitalsc.lib.vt.edu/files/original/3952/TX715.H257_1914.pdf,Document,"History of Food & Drink Collection Rare Books & Publications",1,0
3953,https://digitalsc.lib.vt.edu/items/show/3953,"The Cottage Kitchen. A Collection of Practical and Inexpensive Receipts",,"History of Food and Drink","276 pages",,,"Harland, Marion","History of Food and Drink Collection, Special Collections, University Libraries, Virginia Tech","New York: C. Scribner's Sons",1833,,,,,,,,,,"In the public domain.",,,,,,,,,,,,,,,,,,,,,Books,TX715.T346_1833,,,,,,,,,,,,,,,,,,,,,,,,,,,,,,,,,,,,,,,,,,,,,,,,,PDF,,,,,,,,,,,,,,,,,,,,,,,,,,,,,,,,,,,https://digitalsc.lib.vt.edu/files/original/3953/TX715.T346_1833.pdf,Document,"History of Food & Drink Collection Rare Books & Publications",1,0
3954,https://digitalsc.lib.vt.edu/items/show/3954,"Common Sense in the Household: a Manual of Practical Housewifery",,"History of Food and Drink","228 pages",,,"Harland, Marion","History of Food and Drink Collection, Special Collections, University Libraries, Virginia Tech","New York: Scribner, Armstrong & Co.",1877,,,,,,,,,,"In the public domain.",,,,,,,,,,,,,,,,,,,,,Books,TX715.H28_1877,,,,,,,,,,,,,,,,,,,,,,,,,,,,,,,,,,,,,,,,,,,,,,,,,PDF,,,,,,,,,,,,,,,,,,,,,,,,,,,,,,,,,,,https://digitalsc.lib.vt.edu/files/original/3954/TX715.H28_1877.pdf,Document,"History of Food & Drink Collection Rare Books & Publications",1,0
3955,https://digitalsc.lib.vt.edu/items/show/3955,"Cookery for Beginners, a Series of Familiar Lessons for Young Housekeepers",,"History of Food and Drink","157 pages",,,"Harland, Marion","History of Food and Drink Collection, Special Collections, University Libraries, Virginia Tech","Boston: D. Lothrop and Co.",1884,,,,,,,,,,"In the public domain.",,,,,,,,,,,,,,,,,,,,,Books,TX715.T343_1884,,,,,,,,,,,,,,,,,,,,,,,,,,,,,,,,,,,,,,,,,,,,,,,,,PDF,,,,,,,,,,,,,,,,,,,,,,,,,,,,,,,,,,,https://digitalsc.lib.vt.edu/files/original/3955/TX715.T343_1884.pdf,Document,"History of Food & Drink Collection Rare Books & Publications",1,0
3956,https://digitalsc.lib.vt.edu/items/show/3956,"365 Luncheon Dishes: a Luncheon Dish for Every Day in the Year, Selected from Marion Harland, Christine Terhune Herrick, Boston Cooking School Magazine, Table Talk, Good Housekeeping, and Others",,"History of Food and Drink","151 pages",,,"Harland, Marion","History of Food and Drink Collection, Special Collections, University Libraries, Virginia Tech","Philadelphia: George W. Jacobs & Co.",1902,,,,,,,,,,"In the public domain.",,,,,,,,,,,,,,,,,,,,,Books,TX735.T57_1902,,,,,,,,,,,,,,,,,,,,,,,,,,,,,,,,,,,,,,,,,,,,,,,,,PDF,,,,,,,,,,,,,,,,,,,,,,,,,,,,,,,,,,,https://digitalsc.lib.vt.edu/files/original/3956/TX735.T57_1902.pdf,Document,"History of Food & Drink Collection Rare Books & Publications",1,0
3957,https://digitalsc.lib.vt.edu/items/show/3957,"Common Sense in the Household: a Manual of Practical Housewifery",,"History of Food and Drink","546 pages",,,"Harland, Marion","History of Food and Drink Collection, Special Collections, University Libraries, Virginia Tech","New York: C. Scribner's Sons",1886,,,,,,,,,,"In the public domain.",,,,,,,,,,,,,,,,,,,,,Books,TX715.H28_1886,,,,,,,,,,,,,,,,,,,,,,,,,,,,,,,,,,,,,,,,,,,,,,,,,PDF,,,,,,,,,,,,,,,,,,,,,,,,,,,,,,,,,,,https://digitalsc.lib.vt.edu/files/original/3957/TX715.H28_1886.pdf,Document,"History of Food & Drink Collection Rare Books & Publications",1,0
3958,https://digitalsc.lib.vt.edu/items/show/3958,"Allied Cookery, British, French, Italian, Belgian, Russian, Arranged by Grace Clergue Harrison and Gertrude Clergue, to Aid the War Sufferers in the Devastated Districts of France",,"History of Food and Drink","108 pages",,,"Harrison, Grace Clergue|Clergue, Gertrude","History of Food and Drink Collection, Special Collections, University Libraries, Virginia Tech","New York: G. P. Putnam's Sons",1916,,,,,,,,,,"In the public domain.",,,,,,,,,,,,,,,,,,,,,Books,TX725.H35_1916,,,,,,,,,,,,,,,,,,,,,,,,,,,,,,,,,,,,,,,,,,,,,,,,,PDF,,,,,,,,,,,,,,,,,,,,,,,,,,,,,,,,,,,https://digitalsc.lib.vt.edu/files/original/3958/TX725.H35_1916.pdf,Document,"History of Food & Drink Collection Rare Books & Publications",1,0
3959,https://digitalsc.lib.vt.edu/items/show/3959,"Diet for the Sick; A Treatise on the Values of Foods",,"History of Food and Drink","234 pages",,,"Henderson, Mary F.","History of Food and Drink Collection, Special Collections, University Libraries, Virginia Tech","New York: Harper",1885,,,,,,,,,,"In the public domain.",,,,,,,,,,,,,,,,,,,,,Books,RM219.H52_1885,,,,,,,,,,,,,,,,,,,,,,,,,,,,,,,,,,,,,,,,,,,,,,,,,PDF,,,,,,,,,,,,,,,,,,,,,,,,,,,,,,,,,,,https://digitalsc.lib.vt.edu/files/original/3959/RM219.H52_1885.pdf,Document,"History of Food & Drink Collection Rare Books & Publications",1,0
3960,https://digitalsc.lib.vt.edu/items/show/3960,"Practical Cooking and Dinner Giving: a Treatise Containing Practical Instructions in Cooking",,"History of Food and Drink","375 pages",,,"Henderson, Mary F.","History of Food and Drink Collection, Special Collections, University Libraries, Virginia Tech","New York: Harper & Brothers",1886,,,,,,,,,,"In the public domain.",,,,,,,,,,,,,,,,,,,,,Books,TX715.H498_1886,,,,,,,,,,,,,,,,,,,,,,,,,,,,,,,,,,,,,,,,,,,,,,,,,PDF,,,,,,,,,,,,,,,,,,,,,,,,,,,,,,,,,,,https://digitalsc.lib.vt.edu/files/original/3960/TX715.H498_1886.pdf,Document,"History of Food & Drink Collection Rare Books & Publications",1,0
3961,https://digitalsc.lib.vt.edu/items/show/3961,"The Chafing-Dish Supper",,"History of Food and Drink","112 pages",,,"Herrick, Christine Terhune","History of Food and Drink Collection, Special Collections, University Libraries, Virginia Tech","New York: C. Scribner's Sons",1894,,,,,,,,,,"In the public domain.",,,,,,,,,,,,,,,,,,,,,Books,TX825.H5_1894,,,,,,,,,,,,,,,,,,,,,,,,,,,,,,,,,,,,,,,,,,,,,,,,,PDF,,,,,,,,,,,,,,,,,,,,,,,,,,,,,,,,,,,https://digitalsc.lib.vt.edu/files/original/3961/TX825.H5_1894.pdf,Document,"History of Food & Drink Collection Rare Books & Publications",1,0
3962,https://digitalsc.lib.vt.edu/items/show/3962,"Consolidated Library of Modern Cooking and Household Recipes",,"History of Food and Drink",,,,"Herrick, Christine Terhune","History of Food and Drink Collection, Special Collections, University Libraries, Virginia Tech","New York: R. J. Bodner Company",1905,,,,,,,,,,"In the public domain.",,,,,,,,,,,,,,,,,,,,,Books,TX715.H477_1905,,,,,,,,,,,,,,,,,,,,,,,,,,,,,,,,,,,,,,,,,,,,,,,,,PDF,,,,,,,,,,,,,,,,,,,,,,,,,,,,,,,,,,,https://digitalsc.lib.vt.edu/files/original/3962/TX715.H477_1905.pdf,Document,"History of Food & Drink Collection Rare Books & Publications",1,0
3963,https://digitalsc.lib.vt.edu/items/show/3963,"Salads, Sandwiches and Chafing-dish Dainties",,"History of Food and Drink","250 pages",,,"Hill, Janet McKenzie","History of Food and Drink Collection, Special Collections, University Libraries, Virginia Tech","Boston: Little, Brown",1899,,,,,,,,,,"In the public domain.",,,,,,,,,,,,,,,,,,,,,Books,TX715.H674_1899,,,,,,,,,,,,,,,,,,,,,,,,,,,,,,,,,,,,,,,,,,,,,,,,,PDF,,,,,,,,,,,,,,,,,,,,,,,,,,,,,,,,,,,https://digitalsc.lib.vt.edu/files/original/3963/TX715.H674_1899.pdf,Document,"History of Food & Drink Collection Rare Books & Publications",1,0
3964,https://digitalsc.lib.vt.edu/items/show/3964,"Cooking for Two; A Handbook for Young Housekeepers",,"History of Food and Drink","407 pages",,,"Hill, Janet McKenzie","History of Food and Drink Collection, Special Collections, University Libraries, Virginia Tech","Boston: Little, Brown and Company",1909,,,,,,,,,,"In the public domain.",,,,,,,,,,,,,,,,,,,,,Books,TX715.H657_1909,,,,,,,,,,,,,,,,,,,,,,,,,,,,,,,,,,,,,,,,,,,,,,,,,PDF,,,,,,,,,,,,,,,,,,,,,,,,,,,,,,,,,,,https://digitalsc.lib.vt.edu/files/original/3964/TX715.H657_1909.pdf,Document,"History of Food & Drink Collection Rare Books & Publications",1,0
3965,https://digitalsc.lib.vt.edu/items/show/3965,"Salads, Sandwiches and Chafing-dish Dainties",,"History of Food and Drink","231 pages",,,"Hill, Janet McKenzie","History of Food and Drink Collection, Special Collections, University Libraries, Virginia Tech","Boston: Little, Brown and Company",1918,,,,,,,,,,"In the public domain.",,,,,,,,,,,,,,,,,,,,,Books,TX715.H674_1918,,,,,,,,,,,,,,,,,,,,,,,,,,,,,,,,,,,,,,,,,,,,,,,,,PDF,,,,,,,,,,,,,,,,,,,,,,,,,,,,,,,,,,,https://digitalsc.lib.vt.edu/files/original/3965/TX715.H674_1918.pdf,Document,"History of Food & Drink Collection Rare Books & Publications",1,0
3966,https://digitalsc.lib.vt.edu/items/show/3966,"Cooking for Two: A Handbook for Young Housekeepers",,"History of Food and Drink","407 pages",,,"Hill, Janet McKenzie","History of Food and Drink Collection, Special Collections, University Libraries, Virginia Tech","Boston: Little, Brown",1923,,,,,,,,,,"In the public domain.",,,,,,,,,,,,,,,,,,,,,Books,TX715.H657_1923,,,,,,,,,,,,,,,,,,,,,,,,,,,,,,,,,,,,,,,,,,,,,,,,,PDF,,,,,,,,,,,,,,,,,,,,,,,,,,,,,,,,,,,https://digitalsc.lib.vt.edu/files/original/3966/TX715.H657_1923.pdf,Document,"History of Food & Drink Collection Rare Books & Publications",1,0
3968,https://digitalsc.lib.vt.edu/items/show/3968,"Nyal Cook Book, Practical Recipes That Have Been Tested in Actual Use",,"History of Food and Drink","224 pages",,,"Hill, Janet McKenzie","History of Food and Drink Collection, Special Collections, University Libraries, Virginia Tech","Boston: Nyal Company",1916,,,,,,,,,,"In the public domain.",,,,,,,,,,,,,,,,,,,,,Books,TX715.H658_1916,,,,,,,,,,,,,,,,,,,,,,,,,,,,,,,,,,,,,,,,,,,,,,,,,PDF,,,,,,,,,,,,,,,,,,,,,,,,,,,,,,,,,,,https://digitalsc.lib.vt.edu/files/original/3968/TX715.H658_1916.pdf,Document,"History of Food & Drink Collection Rare Books & Publications",1,0