﻿"Item Id","Item URI","Dublin Core:Title","Dublin Core:Alternative Title","Dublin Core:Subject","Dublin Core:Description","Dublin Core:Abstract","Dublin Core:Table Of Contents","Dublin Core:Creator","Dublin Core:Source","Dublin Core:Publisher","Dublin Core:Date","Dublin Core:Date Available","Dublin Core:Date Created","Dublin Core:Date Accepted","Dublin Core:Date Copyrighted","Dublin Core:Date Submitted","Dublin Core:Date Issued","Dublin Core:Date Modified","Dublin Core:Date Valid","Dublin Core:Contributor","Dublin Core:Rights","Dublin Core:Access Rights","Dublin Core:License","Dublin Core:Relation","Dublin Core:Conforms To","Dublin Core:Has Format","Dublin Core:Has Part","Dublin Core:Has Version","Dublin Core:Is Format Of","Dublin Core:Is Part Of","Dublin Core:Is Referenced By","Dublin Core:Is Replaced By","Dublin Core:Is Required By","Dublin Core:Is Version Of","Dublin Core:References","Dublin Core:Replaces","Dublin Core:Requires","Dublin Core:Format","Dublin Core:Extent","Dublin Core:Medium","Dublin Core:Language","Dublin Core:Type","Dublin Core:Identifier","Dublin Core:Bibliographic Citation","Dublin Core:Coverage","Dublin Core:Spatial Coverage","Dublin Core:Temporal Coverage","Dublin Core:Accrual Method","Dublin Core:Accrual Periodicity","Dublin Core:Accrual Policy","Dublin Core:Audience","Dublin Core:Audience Education Level","Dublin Core:Mediator","Dublin Core:Instructional Method","Dublin Core:Provenance","Dublin Core:Rights Holder","Item Type Metadata:Text","Item Type Metadata:Interviewer","Item Type Metadata:Interviewee","Item Type Metadata:Location","Item Type Metadata:Transcription","Item Type Metadata:Local URL","Item Type Metadata:Original Format","Item Type Metadata:Physical Dimensions","Item Type Metadata:Duration","Item Type Metadata:Compression","Item Type Metadata:Producer","Item Type Metadata:Director","Item Type Metadata:Bit Rate/Frequency","Item Type Metadata:Time Summary","Item Type Metadata:Email Body","Item Type Metadata:Subject Line","Item Type Metadata:From","Item Type Metadata:To","Item Type Metadata:CC","Item Type Metadata:BCC","Item Type Metadata:Number of Attachments","Item Type Metadata:Standards","Item Type Metadata:Objectives","Item Type Metadata:Materials","Item Type Metadata:Lesson Plan Text","Item Type Metadata:URL","Item Type Metadata:Event Type","Item Type Metadata:Participants","Item Type Metadata:Birth Date","Item Type Metadata:Birthplace","Item Type Metadata:Death Date","Item Type Metadata:Occupation","Item Type Metadata:Biographical Text","Item Type Metadata:Bibliography","Item Type Metadata:Transcript","Item Type Metadata:Viewer","Item Type Metadata:Player","Item Type Metadata:Frame Rate","Item Type Metadata:Display Resolution","Item Type Metadata:Production Team","Item Type Metadata:Narrator","Omeka Legacy File:Additional Creator","Omeka Legacy File:Transcriber","Omeka Legacy File:Producer","Omeka Legacy File:Render Device","Omeka Legacy File:Render Details","Omeka Legacy File:Capture Date","Omeka Legacy File:Capture Device","Omeka Legacy File:Capture Details","Omeka Legacy File:Change History","Omeka Legacy File:Watermark","Omeka Legacy File:Encryption","Omeka Legacy File:Compression","Omeka Legacy File:Post Processing","Omeka Image File:Width","Omeka Image File:Height","Omeka Image File:Bit Depth","Omeka Image File:Channels","Omeka Image File:Exif String","Omeka Image File:Exif Array","Omeka Image File:IPTC String","Omeka Image File:IPTC Array","Omeka Video File:Bitrate","Omeka Video File:Duration","Omeka Video File:Sample Rate","Omeka Video File:Codec","Omeka Video File:Width","Omeka Video File:Height","PDF Text:Text",tags,file,itemType,collection,public,featured
18145,https://digitalsc.lib.vt.edu/items/show/18145,"Receipt for James Brooks",,,"Note stating that James Brooks has paid his debt in full. Note also contains pig-pen cipher that says 'Wythe County Va. Oct. 2, 1816."" It is unclear if the date corresponds to the rest of the note.",,,,"<a href=""https://aspace.lib.vt.edu/repositories/2/resources/2132"" target=""_blank"" rel=""noreferrer noopener"">https://aspace.lib.vt.edu/repositories/2/resources/2132</a>",,,,,,,,,,,,"<a href=""http://rightsstatements.org/vocab/CNE/1.0/"" target=""_blank"" rel=""noreferrer noopener"">http://rightsstatements.org/vocab/CNE/1.0/</a>",,,,,,,,,"Ms2000-092, Box 1, Folder 14",,,,,,,,,,,English,,"Ms2000-092_F14_Notes and bills_nd1","[identification of item], [box and folder number], Southwest Virginia Counties Collection, Ms2000-092, Special Collections and University Archives, Virginia Tech, Blacksburg, Va",,,,,,,,,,,,,,,,,,,,,,,,,,,,,,,,,,,,,,,,,,,,,,,,,,,,,,,,,,,,,,,,,,,,,,,,,,,,,,,,,,,https://digitalsc.lib.vt.edu/files/original/a3901a4d9deb85c3353a26b341b59404.jpg,"Still Image","Southwest Virginia Counties Collection (Ms2000-092)",1,0
18146,https://digitalsc.lib.vt.edu/items/show/18146,"Account against Thomas",,,"Undated bill for [Thomas].",,,,"<a href=""https://aspace.lib.vt.edu/repositories/2/resources/2132"" target=""_blank"" rel=""noreferrer noopener"">https://aspace.lib.vt.edu/repositories/2/resources/2132</a>",,,,,,,,,,,,"<a href=""http://rightsstatements.org/vocab/CNE/1.0/"" target=""_blank"" rel=""noreferrer noopener"">http://rightsstatements.org/vocab/CNE/1.0/</a>",,,,,,,,,"Ms2000-092, Box 1, Folder 14",,,,,,,,,,,English,,"Ms2000-092_F14_Notes and bills_nd2a","[identification of item], [box and folder number], Southwest Virginia Counties Collection, Ms2000-092, Special Collections and University Archives, Virginia Tech, Blacksburg, Va",,,,,,,,,,,,,,,,,,,,,,,,,,,,,,,,,,,,,,,,,,,,,,,,,,,,,,,,,,,,,,,,,,,,,,,,,,,,,,,,,,,"https://digitalsc.lib.vt.edu/files/original/3bd67588225a32cbcae19070df4a14ec.jpg,https://digitalsc.lib.vt.edu/files/original/9a209cce48bce7289719ba734c48dfec.jpg","Still Image","Southwest Virginia Counties Collection (Ms2000-092)",1,0
18147,https://digitalsc.lib.vt.edu/items/show/18147,Lines,,,"Sheet of paper containing the repeated phrase ""Commandments ten god gave to men.""",,,,"<a href=""https://aspace.lib.vt.edu/repositories/2/resources/2132"" target=""_blank"" rel=""noreferrer noopener"">https://aspace.lib.vt.edu/repositories/2/resources/2132</a>",,,,,,,,,,,,"<a href=""http://rightsstatements.org/vocab/CNE/1.0/"" target=""_blank"" rel=""noreferrer noopener"">http://rightsstatements.org/vocab/CNE/1.0/</a>",,,,,,,,,"Ms2000-092, Box 1, Folder 14",,,,,,,,,,,English,,"Ms2000-092_F14_Notes and bills_nd3a","[identification of item], [box and folder number], Southwest Virginia Counties Collection, Ms2000-092, Special Collections and University Archives, Virginia Tech, Blacksburg, Va",,,,,,,,,,,,,,,,,,,,,,,,,,,,,,,,,,,,,,,,,,,,,,,,,,,,,,,,,,,,,,,,,,,,,,,,,,,,,,,,,,,"https://digitalsc.lib.vt.edu/files/original/58efde97826cb7d51827c3429ac172f7.jpg,https://digitalsc.lib.vt.edu/files/original/139e232c5be6c3a67872161487805758.jpg","Still Image","Southwest Virginia Counties Collection (Ms2000-092)",1,0
18148,https://digitalsc.lib.vt.edu/items/show/18148,"Undated Bill",,,"undated bill for an unknown person.",,,,"<a href=""https://aspace.lib.vt.edu/repositories/2/resources/2132"" target=""_blank"" rel=""noreferrer noopener"">https://aspace.lib.vt.edu/repositories/2/resources/2132</a>",,,,,,,,,,,,"<a href=""http://rightsstatements.org/vocab/CNE/1.0/"" target=""_blank"" rel=""noreferrer noopener"">http://rightsstatements.org/vocab/CNE/1.0/</a>",,,,,,,,,"Ms2000-092, Box 1, Folder 14",,,,,,,,,,,English,,"Ms2000-092_F14_Notes and bills_nd4a","[identification of item], [box and folder number], Southwest Virginia Counties Collection, Ms2000-092, Special Collections and University Archives, Virginia Tech, Blacksburg, Va",,,,,,,,,,,,,,,,,,,,,,,,,,,,,,,,,,,,,,,,,,,,,,,,,,,,,,,,,,,,,,,,,,,,,,,,,,,,,,,,,,,"https://digitalsc.lib.vt.edu/files/original/f3cf6972374c22f72e0b1e0ed0849760.jpg,https://digitalsc.lib.vt.edu/files/original/331447ab3542ca656058ff58e46828f5.jpg","Still Image","Southwest Virginia Counties Collection (Ms2000-092)",1,0
18149,https://digitalsc.lib.vt.edu/items/show/18149,"Drafts of a Promise to Pay",,,"Drafts of a promise to pay Mitchell C. Brawley an unspecified sum.",,,,"<a href=""https://aspace.lib.vt.edu/repositories/2/resources/2132"" target=""_blank"" rel=""noreferrer noopener"">https://aspace.lib.vt.edu/repositories/2/resources/2132</a>",,,,,,,,,,,,"<a href=""http://rightsstatements.org/vocab/CNE/1.0/"" target=""_blank"" rel=""noreferrer noopener"">http://rightsstatements.org/vocab/CNE/1.0/</a>",,,,,,,,,"Ms2000-092, Box 1, Folder 14",,,,,,,,,,,English,,"Ms2000-092_F14_Notes and bills_nd5a","[identification of item], [box and folder number], Southwest Virginia Counties Collection, Ms2000-092, Special Collections and University Archives, Virginia Tech, Blacksburg, Va",,,,,,,,,,,,,,,,,,,,,,,,,,,,,,,,,,,,,,,,,,,,,,,,,,,,,,,,,,,,,,,,,,,,,,,,,,,,,,,,,,,"https://digitalsc.lib.vt.edu/files/original/0ee60470e25d8abf49b651fc83148b51.jpg,https://digitalsc.lib.vt.edu/files/original/cb13e02b4ec662ef9c040cd4f4fd81ad.jpg","Still Image","Southwest Virginia Counties Collection (Ms2000-092)",1,0
18150,https://digitalsc.lib.vt.edu/items/show/18150,"John Bralley Account",,,"Account sheet of John Bralley.",,,,"<a href=""https://aspace.lib.vt.edu/repositories/2/resources/2132"" target=""_blank"" rel=""noreferrer noopener"">https://aspace.lib.vt.edu/repositories/2/resources/2132</a>",,,,,,,,,,,,"<a href=""http://rightsstatements.org/vocab/CNE/1.0/"" target=""_blank"" rel=""noreferrer noopener"">http://rightsstatements.org/vocab/CNE/1.0/</a>",,,,,,,,,"Ms2000-092, Box 1, Folder 14",,,,,,,,,,,English,,"Ms2000-092_F14_Notes and bills_nd6a","[identification of item], [box and folder number], Southwest Virginia Counties Collection, Ms2000-092, Special Collections and University Archives, Virginia Tech, Blacksburg, Va",,,,,,,,,,,,,,,,,,,,,,,,,,,,,,,,,,,,,,,,,,,,,,,,,,,,,,,,,,,,,,,,,,,,,,,,,,,,,,,,,,,"https://digitalsc.lib.vt.edu/files/original/c21e023744172e5f98c2f80a28caf5ce.jpg,https://digitalsc.lib.vt.edu/files/original/673568be8676194e2503d079a4b0210c.jpg","Still Image","Southwest Virginia Counties Collection (Ms2000-092)",1,0
18151,https://digitalsc.lib.vt.edu/items/show/18151,"Constitution of the Bible Society",,,"Constitution of the Cripple Creek Bible Society.",,,,"<a href=""https://aspace.lib.vt.edu/repositories/2/resources/2132"" target=""_blank"" rel=""noreferrer noopener"">https://aspace.lib.vt.edu/repositories/2/resources/2132</a>",,,,,,,,,,,,"<a href=""http://rightsstatements.org/vocab/CNE/1.0/"" target=""_blank"" rel=""noreferrer noopener"">http://rightsstatements.org/vocab/CNE/1.0/</a>",,,,,,,,,"Ms2000-092, Box 1, Folder 14",,,,,,,,,,,English,,"Ms2000-092_F14_Notes and bills_nd7a","[identification of item], [box and folder number], Southwest Virginia Counties Collection, Ms2000-092, Special Collections and University Archives, Virginia Tech, Blacksburg, Va",,,,,,,,,,,,,,,,,,,,,,,,,,,,,,,,,,,,,,,,,,,,,,,,,,,,,,,,,,,,,,,,,,,,,,,,,,,,,,,,,,,"https://digitalsc.lib.vt.edu/files/original/f1bc5429baeb6b9a2bc2c11371cea329.jpg,https://digitalsc.lib.vt.edu/files/original/cd66588328e0b0a0ff2e93808dce58ac.jpg","Still Image","Southwest Virginia Counties Collection (Ms2000-092)",1,0
18152,https://digitalsc.lib.vt.edu/items/show/18152,"List of those in Arrears",,,"List of people in arrears, presumably belonging to John Bralley.",,,,"<a href=""https://aspace.lib.vt.edu/repositories/2/resources/2132"" target=""_blank"" rel=""noreferrer noopener"">https://aspace.lib.vt.edu/repositories/2/resources/2132</a>",,,,,,,,,,,,"<a href=""http://rightsstatements.org/vocab/CNE/1.0/"" target=""_blank"" rel=""noreferrer noopener"">http://rightsstatements.org/vocab/CNE/1.0/</a>",,,,,,,,,"Ms2000-092, Box 1, Folder 14",,,,,,,,,,,English,,"Ms2000-092_F14_Notes and bills_nd8a","[identification of item], [box and folder number], Southwest Virginia Counties Collection, Ms2000-092, Special Collections and University Archives, Virginia Tech, Blacksburg, Va",,,,,,,,,,,,,,,,,,,,,,,,,,,,,,,,,,,,,,,,,,,,,,,,,,,,,,,,,,,,,,,,,,,,,,,,,,,,,,,,,,,"https://digitalsc.lib.vt.edu/files/original/b24d9d65fb4bd0e30d4f99febfa6cdc7.jpg,https://digitalsc.lib.vt.edu/files/original/722b4b39f9d02183a4187762cb2e4784.jpg,https://digitalsc.lib.vt.edu/files/original/6db687de4827b4418e2d60628dbbc9a8.jpg,https://digitalsc.lib.vt.edu/files/original/cc5f0269b714dbbb1a9828914a159399.jpg","Still Image","Southwest Virginia Counties Collection (Ms2000-092)",1,0
18153,https://digitalsc.lib.vt.edu/items/show/18153,"Old Bill",,,"Crossed out bill; used as paper to get arithmetic solutions.",,,,"<a href=""https://aspace.lib.vt.edu/repositories/2/resources/2132"" target=""_blank"" rel=""noreferrer noopener"">https://aspace.lib.vt.edu/repositories/2/resources/2132</a>",,,,,,,,,,,,"<a href=""http://rightsstatements.org/vocab/CNE/1.0/"" target=""_blank"" rel=""noreferrer noopener"">http://rightsstatements.org/vocab/CNE/1.0/</a>",,,,,,,,,"Ms2000-092, Box 1, Folder 14",,,,,,,,,,,English,,"Ms2000-092_F14_Notes and bills_nda","[identification of item], [box and folder number], Southwest Virginia Counties Collection, Ms2000-092, Special Collections and University Archives, Virginia Tech, Blacksburg, Va",,,,,,,,,,,,,,,,,,,,,,,,,,,,,,,,,,,,,,,,,,,,,,,,,,,,,,,,,,,,,,,,,,,,,,,,,,,,,,,,,,,"https://digitalsc.lib.vt.edu/files/original/e264615e9f7fc2c5dfc5e273974e72d3.jpg,https://digitalsc.lib.vt.edu/files/original/35d08168f6e596764e99db9e61934585.jpg","Still Image","Southwest Virginia Counties Collection (Ms2000-092)",1,0
18154,https://digitalsc.lib.vt.edu/items/show/18154,"Weaving Pattern for Stars and Squares",,,"Weaving pattern for stars and squares, or the Ladies' delight, by Nancy Thrasher.",,,"Thrasher, Nancy","<a href=""https://aspace.lib.vt.edu/repositories/2/resources/2132"" target=""_blank"" rel=""noreferrer noopener"">https://aspace.lib.vt.edu/repositories/2/resources/2132</a>",,1836-07-30,,,,,,,,,,"<a href=""http://rightsstatements.org/vocab/CNE/1.0/"" target=""_blank"" rel=""noreferrer noopener"">http://rightsstatements.org/vocab/CNE/1.0/</a>",,,,,,,,,"Ms2000-092, Box 1, Folder 15",,,,,,,,,,,English,,"Ms2000-092_F15_Weaving Patterns_1836_0730","[identification of item], [box and folder number], Southwest Virginia Counties Collection, Ms2000-092, Special Collections and University Archives, Virginia Tech, Blacksburg, Va",,,,,,,,,,,,,,,,,,,,,,,,,,,,,,,,,,,,,,,,,,,,,,,,,,,,,,,,,,,,,,,,,,,,,,,,,,,,,,,,,,,https://digitalsc.lib.vt.edu/files/original/07d576f3cc3c9e86e8709858ab6ce8f1.jpg,"Still Image","Southwest Virginia Counties Collection (Ms2000-092)",1,0
18155,https://digitalsc.lib.vt.edu/items/show/18155,"Twitted Bird Eye Pattern",,,"Weaving pattern for Twitted Bird Eye, made by Mary Jane Trevey.",,,"Trevey, Mary J.","<a href=""https://aspace.lib.vt.edu/repositories/2/resources/2132"" target=""_blank"" rel=""noreferrer noopener"">https://aspace.lib.vt.edu/repositories/2/resources/2132</a>",,1839-11-07,,,,,,,,,,"<a href=""http://rightsstatements.org/vocab/CNE/1.0/"" target=""_blank"" rel=""noreferrer noopener"">http://rightsstatements.org/vocab/CNE/1.0/</a>",,,,,,,,,"Ms2000-092, Box 1, Folder 15",,,,,,,,,,,English,,"Ms2000-092_F15_Weaving Patterns_1839_1107","[identification of item], [box and folder number], Southwest Virginia Counties Collection, Ms2000-092, Special Collections and University Archives, Virginia Tech, Blacksburg, Va",,,,,,,,,,,,,,,,,,,,,,,,,,,,,,,,,,,,,,,,,,,,,,,,,,,,,,,,,,,,,,,,,,,,,,,,,,,,,,,,,,,https://digitalsc.lib.vt.edu/files/original/ed86af75677f508a72c57188a269c760.jpg,"Still Image","Southwest Virginia Counties Collection (Ms2000-092)",1,0
18156,https://digitalsc.lib.vt.edu/items/show/18156,"Vines Weaving Pattern",,,"Vines weaving pattern.",,,,"<a href=""https://aspace.lib.vt.edu/repositories/2/resources/2132"" target=""_blank"" rel=""noreferrer noopener"">https://aspace.lib.vt.edu/repositories/2/resources/2132</a>",,1839,,,,,,,,,,"<a href=""http://rightsstatements.org/vocab/CNE/1.0/"" target=""_blank"" rel=""noreferrer noopener"">http://rightsstatements.org/vocab/CNE/1.0/</a>",,,,,,,,,"Ms2000-092, Box 1, Folder 15",,,,,,,,,,,English,,"Ms2000-092_F15_Weaving Patterns_1839","[identification of item], [box and folder number], Southwest Virginia Counties Collection, Ms2000-092, Special Collections and University Archives, Virginia Tech, Blacksburg, Va",,,,,,,,,,,,,,,,,,,,,,,,,,,,,,,,,,,,,,,,,,,,,,,,,,,,,,,,,,,,,,,,,,,,,,,,,,,,,,,,,,,https://digitalsc.lib.vt.edu/files/original/0ea9826b271e03c3b8f511a37076fe60.jpg,"Still Image","Southwest Virginia Counties Collection (Ms2000-092)",1,0
18157,https://digitalsc.lib.vt.edu/items/show/18157,"Draft for Stars and Squares Weaving Pattern",,,"Draft for stars and squares weaving pattern for Mary Jane Trevey.",,,"Trevey, Mary J.","<a href=""https://aspace.lib.vt.edu/repositories/2/resources/2132"" target=""_blank"" rel=""noreferrer noopener"">https://aspace.lib.vt.edu/repositories/2/resources/2132</a>",,1841-01-29,,,,,,,,,,"<a href=""http://rightsstatements.org/vocab/CNE/1.0/"" target=""_blank"" rel=""noreferrer noopener"">http://rightsstatements.org/vocab/CNE/1.0/</a>",,,,,,,,,"Ms2000-092, Box 1, Folder 15",,,,,,,,,,,English,,"Ms2000-092_F15_Weaving Patterns_1841_0129","[identification of item], [box and folder number], Southwest Virginia Counties Collection, Ms2000-092, Special Collections and University Archives, Virginia Tech, Blacksburg, Va",,,,,,,,,,,,,,,,,,,,,,,,,,,,,,,,,,,,,,,,,,,,,,,,,,,,,,,,,,,,,,,,,,,,,,,,,,,,,,,,,,,https://digitalsc.lib.vt.edu/files/original/1d4de9780ef3c31cbeb9a9c3c8c8d0aa.jpg,"Still Image","Southwest Virginia Counties Collection (Ms2000-092)",1,0
18158,https://digitalsc.lib.vt.edu/items/show/18158,"Miss Mary J. Trevey Weaving Patterns",,,"Weaving patterns by Mary Jane Trevey.",,,"Trevey, Mary J.","<a href=""https://aspace.lib.vt.edu/repositories/2/resources/2132"" target=""_blank"" rel=""noreferrer noopener"">https://aspace.lib.vt.edu/repositories/2/resources/2132</a>",,1841-03-05,,,,,,,,,,"<a href=""http://rightsstatements.org/vocab/CNE/1.0/"" target=""_blank"" rel=""noreferrer noopener"">http://rightsstatements.org/vocab/CNE/1.0/</a>",,,,,,,,,"Ms2000-092, Box 1, Folder 15",,,,,,,,,,,English,,"Ms2000-092_F15_Weaving Patterns_1841_0305a","[identification of item], [box and folder number], Southwest Virginia Counties Collection, Ms2000-092, Special Collections and University Archives, Virginia Tech, Blacksburg, Va",,,,,,,,,,,,,,,,,,,,,,,,,,,,,,,,,,,,,,,,,,,,,,,,,,,,,,,,,,,,,,,,,,,,,,,,,,,,,,,,,,,"https://digitalsc.lib.vt.edu/files/original/92fd9d050fd4cff6afd3597fe7332c3b.jpg,https://digitalsc.lib.vt.edu/files/original/a5ae3607f8af69699c04e23cc2a3fe88.jpg,https://digitalsc.lib.vt.edu/files/original/aba9c26505b9e70eb1aa0a2e5c16559d.jpg","Still Image","Southwest Virginia Counties Collection (Ms2000-092)",1,0
18159,https://digitalsc.lib.vt.edu/items/show/18159,"Tennessee Beauty Weaving Pattern",,,"Tennessee Beauty pattern, made by [Mary Jane Trevey].",,,,"<a href=""https://aspace.lib.vt.edu/repositories/2/resources/2132"" target=""_blank"" rel=""noreferrer noopener"">https://aspace.lib.vt.edu/repositories/2/resources/2132</a>",,1841-03-08,,,,,,,,,,"<a href=""http://rightsstatements.org/vocab/CNE/1.0/"" target=""_blank"" rel=""noreferrer noopener"">http://rightsstatements.org/vocab/CNE/1.0/</a>",,,,,,,,,"Ms2000-092, Box 1, Folder 15",,,,,,,,,,,English,,"Ms2000-092_F15_Weaving Patterns_1841_0308","[identification of item], [box and folder number], Southwest Virginia Counties Collection, Ms2000-092, Special Collections and University Archives, Virginia Tech, Blacksburg, Va",,,,,,,,,,,,,,,,,,,,,,,,,,,,,,,,,,,,,,,,,,,,,,,,,,,,,,,,,,,,,,,,,,,,,,,,,,,,,,,,,,,https://digitalsc.lib.vt.edu/files/original/ba347ac0aab490a965c302dd37a3f4cd.jpg,"Still Image","Southwest Virginia Counties Collection (Ms2000-092)",1,0
18160,https://digitalsc.lib.vt.edu/items/show/18160,"Sinkin Creek Beauty",,,"Sinkin Creek Beauty pattern, made by Mary Jane Trevey.",,,"Trevey, Mary J.","<a href=""https://aspace.lib.vt.edu/repositories/2/resources/2132"" target=""_blank"" rel=""noreferrer noopener"">https://aspace.lib.vt.edu/repositories/2/resources/2132</a>",,1840-11-15,,,,,,,,,,"<a href=""http://rightsstatements.org/vocab/CNE/1.0/"" target=""_blank"" rel=""noreferrer noopener"">http://rightsstatements.org/vocab/CNE/1.0/</a>",,,,,,,,,"Ms2000-092, Box 1, Folder 15",,,,,,,,,,,English,,"Ms2000-092_F15_Weaving Patterns_1860_1115","[identification of item], [box and folder number], Southwest Virginia Counties Collection, Ms2000-092, Special Collections and University Archives, Virginia Tech, Blacksburg, Va",,,,,,,,,,,,,,,,,,,,,,,,,,,,,,,,,,,,,,,,,,,,,,,,,,,,,,,,,,,,,,,,,,,,,,,,,,,,,,,,,,,https://digitalsc.lib.vt.edu/files/original/0d0c8a6bd7a3c3090216b4e034537819.jpg,"Still Image","Southwest Virginia Counties Collection (Ms2000-092)",1,0
18161,https://digitalsc.lib.vt.edu/items/show/18161,"Fast Thread",,,"Fast thread pattern for the back shaft of a loom.",,,,"<a href=""https://aspace.lib.vt.edu/repositories/2/resources/2132"" target=""_blank"" rel=""noreferrer noopener"">https://aspace.lib.vt.edu/repositories/2/resources/2132</a>",,,,,,,,,,,,"<a href=""http://rightsstatements.org/vocab/CNE/1.0/"" target=""_blank"" rel=""noreferrer noopener"">http://rightsstatements.org/vocab/CNE/1.0/</a>",,,,,,,,,"Ms2000-092, Box 1, Folder 15",,,,,,,,,,,English,,"Ms2000-092_F15_Weaving Patterns_Fast Thred_nd","[identification of item], [box and folder number], Southwest Virginia Counties Collection, Ms2000-092, Special Collections and University Archives, Virginia Tech, Blacksburg, Va",,,,,,,,,,,,,,,,,,,,,,,,,,,,,,,,,,,,,,,,,,,,,,,,,,,,,,,,,,,,,,,,,,,,,,,,,,,,,,,,,,,https://digitalsc.lib.vt.edu/files/original/c5c36b2c2e2402f2f3af8992d264e3c3.jpg,"Still Image","Southwest Virginia Counties Collection (Ms2000-092)",1,0
18162,https://digitalsc.lib.vt.edu/items/show/18162,"Unlabeled Weaving Patterns",,,"Unlabeled and undated weaving patterns.",,,,"<a href=""https://aspace.lib.vt.edu/repositories/2/resources/2132"" target=""_blank"" rel=""noreferrer noopener"">https://aspace.lib.vt.edu/repositories/2/resources/2132</a>",,,,,,,,,,,,"<a href=""http://rightsstatements.org/vocab/CNE/1.0/"" target=""_blank"" rel=""noreferrer noopener"">http://rightsstatements.org/vocab/CNE/1.0/</a>",,,,,,,,,"Ms2000-092, Box 1, Folder 15",,,,,,,,,,,English,,"Ms2000-092_F15_Weaving Patterns_Misc_nd","[identification of item], [box and folder number], Southwest Virginia Counties Collection, Ms2000-092, Special Collections and University Archives, Virginia Tech, Blacksburg, Va",,,,,,,,,,,,,,,,,,,,,,,,,,,,,,,,,,,,,,,,,,,,,,,,,,,,,,,,,,,,,,,,,,,,,,,,,,,,,,,,,,,https://digitalsc.lib.vt.edu/files/original/d41f44ab6a9ac40c017bddb8fe4f8911.jpg,"Still Image","Southwest Virginia Counties Collection (Ms2000-092)",1,0
18163,https://digitalsc.lib.vt.edu/items/show/18163,"Stuart Weaving Pattern",,,"Undated weaving pattern, labeled with both Miss [Mary] Jane Trevey and John B. Stuart.",,,,"<a href=""https://aspace.lib.vt.edu/repositories/2/resources/2132"" target=""_blank"" rel=""noreferrer noopener"">https://aspace.lib.vt.edu/repositories/2/resources/2132</a>",,,,,,,,,,,,"<a href=""http://rightsstatements.org/vocab/CNE/1.0/"" target=""_blank"" rel=""noreferrer noopener"">http://rightsstatements.org/vocab/CNE/1.0/</a>",,,,,,,,,"Ms2000-092, Box 1, Folder 15",,,,,,,,,,,English,,"Ms2000-092_F15_Weaving Patterns_Stuart_nd","[identification of item], [box and folder number], Southwest Virginia Counties Collection, Ms2000-092, Special Collections and University Archives, Virginia Tech, Blacksburg, Va",,,,,,,,,,,,,,,,,,,,,,,,,,,,,,,,,,,,,,,,,,,,,,,,,,,,,,,,,,,,,,,,,,,,,,,,,,,,,,,,,,,https://digitalsc.lib.vt.edu/files/original/5a9564158df29b0ccb617bdc141badfb.jpg,"Still Image","Southwest Virginia Counties Collection (Ms2000-092)",1,0