﻿"Item Id","Item URI","Dublin Core:Title","Dublin Core:Alternative Title","Dublin Core:Subject","Dublin Core:Description","Dublin Core:Abstract","Dublin Core:Table Of Contents","Dublin Core:Creator","Dublin Core:Source","Dublin Core:Publisher","Dublin Core:Date","Dublin Core:Date Available","Dublin Core:Date Created","Dublin Core:Date Accepted","Dublin Core:Date Copyrighted","Dublin Core:Date Submitted","Dublin Core:Date Issued","Dublin Core:Date Modified","Dublin Core:Date Valid","Dublin Core:Contributor","Dublin Core:Rights","Dublin Core:Access Rights","Dublin Core:License","Dublin Core:Relation","Dublin Core:Conforms To","Dublin Core:Has Format","Dublin Core:Has Part","Dublin Core:Has Version","Dublin Core:Is Format Of","Dublin Core:Is Part Of","Dublin Core:Is Referenced By","Dublin Core:Is Replaced By","Dublin Core:Is Required By","Dublin Core:Is Version Of","Dublin Core:References","Dublin Core:Replaces","Dublin Core:Requires","Dublin Core:Format","Dublin Core:Extent","Dublin Core:Medium","Dublin Core:Language","Dublin Core:Type","Dublin Core:Identifier","Dublin Core:Bibliographic Citation","Dublin Core:Coverage","Dublin Core:Spatial Coverage","Dublin Core:Temporal Coverage","Dublin Core:Accrual Method","Dublin Core:Accrual Periodicity","Dublin Core:Accrual Policy","Dublin Core:Audience","Dublin Core:Audience Education Level","Dublin Core:Mediator","Dublin Core:Instructional Method","Dublin Core:Provenance","Dublin Core:Rights Holder","Item Type Metadata:Text","Item Type Metadata:Interviewer","Item Type Metadata:Interviewee","Item Type Metadata:Location","Item Type Metadata:Transcription","Item Type Metadata:Local URL","Item Type Metadata:Original Format","Item Type Metadata:Physical Dimensions","Item Type Metadata:Duration","Item Type Metadata:Compression","Item Type Metadata:Producer","Item Type Metadata:Director","Item Type Metadata:Bit Rate/Frequency","Item Type Metadata:Time Summary","Item Type Metadata:Email Body","Item Type Metadata:Subject Line","Item Type Metadata:From","Item Type Metadata:To","Item Type Metadata:CC","Item Type Metadata:BCC","Item Type Metadata:Number of Attachments","Item Type Metadata:Standards","Item Type Metadata:Objectives","Item Type Metadata:Materials","Item Type Metadata:Lesson Plan Text","Item Type Metadata:URL","Item Type Metadata:Event Type","Item Type Metadata:Participants","Item Type Metadata:Birth Date","Item Type Metadata:Birthplace","Item Type Metadata:Death Date","Item Type Metadata:Occupation","Item Type Metadata:Biographical Text","Item Type Metadata:Bibliography","Item Type Metadata:Transcript","Item Type Metadata:Viewer","Item Type Metadata:Player","Item Type Metadata:Frame Rate","Item Type Metadata:Display Resolution","Item Type Metadata:Production Team","Item Type Metadata:Narrator","Omeka Legacy File:Additional Creator","Omeka Legacy File:Transcriber","Omeka Legacy File:Producer","Omeka Legacy File:Render Device","Omeka Legacy File:Render Details","Omeka Legacy File:Capture Date","Omeka Legacy File:Capture Device","Omeka Legacy File:Capture Details","Omeka Legacy File:Change History","Omeka Legacy File:Watermark","Omeka Legacy File:Encryption","Omeka Legacy File:Compression","Omeka Legacy File:Post Processing","Omeka Image File:Width","Omeka Image File:Height","Omeka Image File:Bit Depth","Omeka Image File:Channels","Omeka Image File:Exif String","Omeka Image File:Exif Array","Omeka Image File:IPTC String","Omeka Image File:IPTC Array","Omeka Video File:Bitrate","Omeka Video File:Duration","Omeka Video File:Sample Rate","Omeka Video File:Codec","Omeka Video File:Width","Omeka Video File:Height","PDF Text:Text",tags,file,itemType,collection,public,featured
5243,https://digitalsc.lib.vt.edu/items/show/5243,"Photograph, S-66-39902, Gemini 10 news conference, [Houston, TX], [August 1, 1966] (Ms1989-029)",,"Science and Technology^^Archives of American Aerospace Exploration (AAAE)^^Astronauts^^Project Gemini (U.S.)^^United States. National Aeronautics and Space Administration","Audience focused on the Gemini 10 Astronauts during the Gemini 10 news conference.",,,"Collins, Michael, 1930-","<a href=""http://search.vaheritage.org/vivaxtf/view?docId=vt/viblbv00092.xml"" target=""_blank"">See the Finding Aid for the Michael Collins Papers</a>",,1966-08-01,,,,,,,,,,"<a href=""https://digitalsc.lib.vt.edu/files/thumbnails/spec_forms/PubPermission.doc"" target=""_blank"">Permission to publish material from the Michael Collins Papers must be obtained from Special Collections, Virginia Tech.</a>",,,"<a href=""http://spaceflight.nasa.gov/gallery/images/gemini/"" target=""_blank"">NASA Gemini Gallery</a>",,,,,,"Ms1989-029, Box 7, Folder 1d",,,,,,,,,,,,Photographs,Ms1989-029_B07_F1d_Photo_1966_ND_07,"Researchers wishing to cite this collection should include the following information: Michael Collins Papers, Ms1989-029, Special Collections, Virginia Polytechnic Institute and State University, Blacksburg, Va.",,,,,,,,,,,,"<a href=""http://spec.lib.vt.edu/"" target=""_blank"">Special Collections, University Libraries, Virginia Tech</a>",,,,,,,,,,,,,,,,,,,,,,,,,,,,,,,,,,,,,,,,,,,,,,,,,,,,,,,,,,,,,,,,,,,,,,,http://spec.lib.vt.edu/pickup/Omeka_upload/Ms1989-029_B07_F1d_Photo_1966_ND_07.jpg,Document,"The Michael Collins Papers (Ms1989-029)",1,0
5248,https://digitalsc.lib.vt.edu/items/show/5248,"Photograph, S-66-39900, chalkboard illustration of Michael Collins during his spacewalk, [Houston, TX], [August 1, 1966] (Ms1989-029)",,"Science and Technology^^Archives of American Aerospace Exploration (AAAE)^^Astronauts^^Project Gemini (U.S.)^^United States. National Aeronautics and Space Administration","Astronaut John W. Young's chalkboard illustration of Michael Collins during his spacewalk inspection of the Agena Target Docking Vehicle.",,,"Collins, Michael, 1930-","<a href=""http://search.vaheritage.org/vivaxtf/view?docId=vt/viblbv00092.xml"" target=""_blank"">See the Finding Aid for the Michael Collins Papers</a>",,1966-08-01,,,,,,,,,,"<a href=""https://digitalsc.lib.vt.edu/files/thumbnails/spec_forms/PubPermission.doc"" target=""_blank"">Permission to publish material from the Michael Collins Papers must be obtained from Special Collections, Virginia Tech.</a>",,,"<a href=""http://spaceflight.nasa.gov/gallery/images/gemini/"" target=""_blank"">NASA Gemini Gallery</a>",,,,,,"Ms1989-029, Box 7, Folder 1d",,,,,,,,,,,,Photographs,Ms1989-029_B07_F1d_Photo_1966_ND_12,"Researchers wishing to cite this collection should include the following information: Michael Collins Papers, Ms1989-029, Special Collections, Virginia Polytechnic Institute and State University, Blacksburg, Va.",,,,,,,,,,,,"<a href=""http://spec.lib.vt.edu/"" target=""_blank"">Special Collections, University Libraries, Virginia Tech</a>",,,,,,,,,,,,,,,,,,,,,,,,,,,,,,,,,,,,,,,,,,,,,,,,,,,,,,,,,,,,,,,,,,,,,,,http://spec.lib.vt.edu/pickup/Omeka_upload/Ms1989-029_B07_F1d_Photo_1966_ND_12.jpg,Document,"The Michael Collins Papers (Ms1989-029)",1,0
5249,https://digitalsc.lib.vt.edu/items/show/5249,"Photograph, S-66-39897, John W. Young  illustrates Michael Collins inspecting the Agena Target Docking Vehicle, [Houston, TX], [August 1, 1966] (Ms1989-029)",,"Science and Technology^^Archives of American Aerospace Exploration (AAAE)^^Astronauts^^Project Gemini (U.S.)^^United States. National Aeronautics and Space Administration","Astronaut John W. Young uses a chalk drawing on a blackboard to illustrate how astronaut Michael Collins looked when he inspected the Agena Target Docking Vehicle during his extravehicular activity.",,,"Collins, Michael, 1930-","<a href=""http://search.vaheritage.org/vivaxtf/view?docId=vt/viblbv00092.xml"" target=""_blank"">See the Finding Aid for the Michael Collins Papers</a>",,1966-08-01,,,,,,,,,,"<a href=""https://digitalsc.lib.vt.edu/files/thumbnails/spec_forms/PubPermission.doc"" target=""_blank"">Permission to publish material from the Michael Collins Papers must be obtained from Special Collections, Virginia Tech.</a>",,,"<a href=""http://spaceflight.nasa.gov/gallery/images/gemini/"" target=""_blank"">NASA Gemini Gallery</a>",,,,,,"Ms1989-029, Box 7, Folder 1d",,,,,,,,,,,,Photographs,Ms1989-029_B07_F1d_Photo_1966_ND_13,"Researchers wishing to cite this collection should include the following information: Michael Collins Papers, Ms1989-029, Special Collections, Virginia Polytechnic Institute and State University, Blacksburg, Va.",,,,,,,,,,,,"<a href=""http://spec.lib.vt.edu/"" target=""_blank"">Special Collections, University Libraries, Virginia Tech</a>",,,,,,,,,,,,,,,,,,,,,,,,,,,,,,,,,,,,,,,,,,,,,,,,,,,,,,,,,,,,,,,,,,,,,,,http://spec.lib.vt.edu/pickup/Omeka_upload/Ms1989-029_B07_F1d_Photo_1966_ND_13.jpg,Document,"The Michael Collins Papers (Ms1989-029)",1,0
5240,https://digitalsc.lib.vt.edu/items/show/5240,"Photograph, S-66-39896, Gemini 10 news conference, [Houston, TX], [August 1, 1966] (Ms1989-029)",,"Science and Technology^^Archives of American Aerospace Exploration (AAAE)^^Astronauts^^Project Gemini (U.S.)^^United States. National Aeronautics and Space Administration","Scene in Building 1 auditorium during the Gemini 10 news conference.",,,"Collins, Michael, 1930-","<a href=""http://search.vaheritage.org/vivaxtf/view?docId=vt/viblbv00092.xml"" target=""_blank"">See the Finding Aid for the Michael Collins Papers</a>",,1966-08-01,,,,,,,,,,"<a href=""https://digitalsc.lib.vt.edu/files/thumbnails/spec_forms/PubPermission.doc"" target=""_blank"">Permission to publish material from the Michael Collins Papers must be obtained from Special Collections, Virginia Tech.</a>",,,"<a href=""http://spaceflight.nasa.gov/gallery/images/gemini/"" target=""_blank"">NASA Gemini Gallery</a>",,,,,,"Ms1989-029, Box 7, Folder 1d",,,,,,,,,,,,Photographs,Ms1989-029_B07_F1d_Photo_1966_ND_04,"Researchers wishing to cite this collection should include the following information: Michael Collins Papers, Ms1989-029, Special Collections, Virginia Polytechnic Institute and State University, Blacksburg, Va.",,,,,,,,,,,,"<a href=""http://spec.lib.vt.edu/"" target=""_blank"">Special Collections, University Libraries, Virginia Tech</a>",,,,,,,,,,,,,,,,,,,,,,,,,,,,,,,,,,,,,,,,,,,,,,,,,,,,,,,,,,,,,,,,,,,,,,,http://spec.lib.vt.edu/pickup/Omeka_upload/Ms1989-029_B07_F1d_Photo_1966_ND_04.jpg,Document,"The Michael Collins Papers (Ms1989-029)",1,0
5244,https://digitalsc.lib.vt.edu/items/show/5244,"Photograph, S-66-39895, Michael Collins, [Houston, TX], [August 1, 1966] (Ms1989-029)",,"Science and Technology^^Archives of American Aerospace Exploration (AAAE)^^Astronauts^^Project Gemini (U.S.)^^United States. National Aeronautics and Space Administration","Astronaut Michael Collins, proudly displaying his Exceptional Service Medal, talks with Dr. Robert C. Seamans Jr. (NASA Deputy Administrator) and Dr. Robert R. Gilruth (Manned Spacecraft Center Director) following the Gemini 10 news conference.",,,"Collins, Michael, 1930-","<a href=""http://search.vaheritage.org/vivaxtf/view?docId=vt/viblbv00092.xml"" target=""_blank"">See the Finding Aid for the Michael Collins Papers</a>",,1966-08-01,,,,,,,,,,"<a href=""https://digitalsc.lib.vt.edu/files/thumbnails/spec_forms/PubPermission.doc"" target=""_blank"">Permission to publish material from the Michael Collins Papers must be obtained from Special Collections, Virginia Tech.</a>",,,"<a href=""http://spaceflight.nasa.gov/gallery/images/gemini/"" target=""_blank"">NASA Gemini Gallery</a>",,,,,,"Ms1989-029, Box 7, Folder 1d",,,,,,,,,,,,Photographs,Ms1989-029_B07_F1d_Photo_1966_ND_08,"Researchers wishing to cite this collection should include the following information: Michael Collins Papers, Ms1989-029, Special Collections, Virginia Polytechnic Institute and State University, Blacksburg, Va.",,,,,,,,,,,,"<a href=""http://spec.lib.vt.edu/"" target=""_blank"">Special Collections, University Libraries, Virginia Tech</a>",,,,,,,,,,,,,,,,,,,,,,,,,,,,,,,,,,,,,,,,,,,,,,,,,,,,,,,,,,,,,,,,,,,,,,,http://spec.lib.vt.edu/pickup/Omeka_upload/Ms1989-029_B07_F1d_Photo_1966_ND_08.jpg,Document,"The Michael Collins Papers (Ms1989-029)",1,0
5242,https://digitalsc.lib.vt.edu/items/show/5242,"Photograph, S-66-39893, Astronaut Michael Collins receiving the Exceptional Service Medal, [Houston, TX], [August 1, 1966] (Ms1989-029)",,"Science and Technology^^Archives of American Aerospace Exploration (AAAE)^^Astronauts^^Project Gemini (U.S.)^^United States. National Aeronautics and Space Administration","Astronaut Michael Collins receiving the Exceptional Service Medal during the Gemini 10 news conference.",,,"Collins, Michael, 1930-","<a href=""http://search.vaheritage.org/vivaxtf/view?docId=vt/viblbv00092.xml"" target=""_blank"">See the Finding Aid for the Michael Collins Papers</a>",,1966-08-01,,,,,,,,,,"<a href=""https://digitalsc.lib.vt.edu/files/thumbnails/spec_forms/PubPermission.doc"" target=""_blank"">Permission to publish material from the Michael Collins Papers must be obtained from Special Collections, Virginia Tech.</a>",,,"<a href=""http://spaceflight.nasa.gov/gallery/images/gemini/"" target=""_blank"">NASA Gemini Gallery</a>",,,,,,"Ms1989-029, Box 7, Folder 1d",,,,,,,,,,,,Photographs,Ms1989-029_B07_F1d_Photo_1966_ND_06,"Researchers wishing to cite this collection should include the following information: Michael Collins Papers, Ms1989-029, Special Collections, Virginia Polytechnic Institute and State University, Blacksburg, Va.",,,,,,,,,,,,"<a href=""http://spec.lib.vt.edu/"" target=""_blank"">Special Collections, University Libraries, Virginia Tech</a>",,,,,,,,,,,,,,,,,,,,,,,,,,,,,,,,,,,,,,,,,,,,,,,,,,,,,,,,,,,,,,,,,,,,,,,http://spec.lib.vt.edu/pickup/Omeka_upload/Ms1989-029_B07_F1d_Photo_1966_ND_06.jpg,Document,"The Michael Collins Papers (Ms1989-029)",1,0
5175,https://digitalsc.lib.vt.edu/items/show/5175,"Photograph, S-66-39767, Gemini 10 Mission press conference, Cape Kennedy, FL, [July 2], 1966 (Ms1989-029)",,"Science and Technology^^Archives of American Aerospace Exploration (AAAE)^^Astronauts^^Project Gemini (U.S.)^^United States. National Aeronautics and Space Administration","NASA Photo S-66-39767. Astronaut Michael Collins giving an explanation during the Gemini 10 press conference.",,,"Collins, Michael, 1930-","<a href=""http://search.vaheritage.org/vivaxtf/view?docId=vt/viblbv00092.xml"" target=""_blank"">See the Finding Aid for the Michael Collins Papers</a>",,1966-07-02,,,,,,,,,,"<a href=""https://digitalsc.lib.vt.edu/files/thumbnails/spec_forms/PubPermission.doc"" target=""_blank"">Permission to publish material from the Michael Collins Papers must be obtained from Special Collections, Virginia Tech.</a>",,,,,,,,,"Ms1989-029, Box 7, Folder 1a",,,,,,,,,,,,Photograph,Ms1989-029_B07_F1a_Photo_1966_ND_09,"Researchers wishing to cite this collection should include the following information: Michael Collins Papers, Ms1989-029, Special Collections, Virginia Polytechnic Institute and State University, Blacksburg, Va.",,,,,,,,,,,,"<a href=""http://spec.lib.vt.edu/"" target=""_blank"">Special Collections, University Libraries, Virginia Tech</a>",,,,,,,,,,,,,,,,,,,,,,,,,,,,,,,,,,,,,,,,,,,,,,,,,,,,,,,,,,,,,,,,,,,,,,,http://spec.lib.vt.edu/pickup/Omeka_upload/Ms1989-029_B07_F1a_Photo_1966_ND_09.jpg,Document,"The Michael Collins Papers (Ms1989-029)",1,0
5174,https://digitalsc.lib.vt.edu/items/show/5174,"Photograph, S-66-39762, Gemini 10 Mission press conference, Cape Kennedy, FL, [July 2], 1966 (Ms1989-029)",,"Science and Technology^^Archives of American Aerospace Exploration (AAAE)^^Astronauts^^Project Gemini (U.S.)^^United States. National Aeronautics and Space Administration","NASA Photo S-66-39762. John W. Young and Michael Collins, along with backup crew Alan Bean and Clifton C. Williams Jr. discuss their upcoming Gemini X mission at a press conference.",,,"Collins, Michael, 1930-","<a href=""http://search.vaheritage.org/vivaxtf/view?docId=vt/viblbv00092.xml"" target=""_blank"">See the Finding Aid for the Michael Collins Papers</a>",,1966-07-02,,,,,,,,,,"<a href=""https://digitalsc.lib.vt.edu/files/thumbnails/spec_forms/PubPermission.doc"" target=""_blank"">Permission to publish material from the Michael Collins Papers must be obtained from Special Collections, Virginia Tech.</a>",,,,,,,,,"Ms1989-029, Box 7, Folder 1a",,,,,,,,,,,,Photograph,Ms1989-029_B07_F1a_Photo_1966_ND_08,"Researchers wishing to cite this collection should include the following information: Michael Collins Papers, Ms1989-029, Special Collections, Virginia Polytechnic Institute and State University, Blacksburg, Va.",,,,,,,,,,,,"<a href=""http://spec.lib.vt.edu/"" target=""_blank"">Special Collections, University Libraries, Virginia Tech</a>",,,,,,,,,,,,,,,,,,,,,,,,,,,,,,,,,,,,,,,,,,,,,,,,,,,,,,,,,,,,,,,,,,,,,,,http://spec.lib.vt.edu/pickup/Omeka_upload/Ms1989-029_B07_F1a_Photo_1966_ND_08.jpg,Document,"The Michael Collins Papers (Ms1989-029)",1,0
5182,https://digitalsc.lib.vt.edu/items/show/5182,"Photograph, S-66-39723, Michael Collins outside of Static Article 5, Gemini 10 Mission, [June 18], 1966 (Ms1989-029)",,"Science and Technology^^Archives of American Aerospace Exploration (AAAE)^^Astronauts^^Project Gemini (U.S.)^^United States. National Aeronautics and Space Administration","NASA Photo S-66-39723. Astronaut Michael Collins outside of Static Article 5, used for water egress training",,,"Collins, Michael, 1930-","<a href=""http://search.vaheritage.org/vivaxtf/view?docId=vt/viblbv00092.xml"" target=""_blank"">See the Finding Aid for the Michael Collins Papers</a>",,1966-06-18,,,,,,,,,,"<a href=""https://digitalsc.lib.vt.edu/files/thumbnails/spec_forms/PubPermission.doc"" target=""_blank"">Permission to publish material from the Michael Collins Papers must be obtained from Special Collections, Virginia Tech.</a>",,,,,,,,,"Ms1989-029, Box 7, Folder 1a",,,,,,,,,,,,Photograph,Ms1989-029_B07_F1a_Photo_1966_ND_16,"Researchers wishing to cite this collection should include the following information: Michael Collins Papers, Ms1989-029, Special Collections, Virginia Polytechnic Institute and State University, Blacksburg, Va.",,,,,,,,,,,,"<a href=""http://spec.lib.vt.edu/"" target=""_blank"">Special Collections, University Libraries, Virginia Tech</a>",,,,,,,,,,,,,,,,,,,,,,,,,,,,,,,,,,,,,,,,,,,,,,,,,,,,,,,,,,,,,,,,,,,,,,,http://spec.lib.vt.edu/pickup/Omeka_upload/Ms1989-029_B07_F1a_Photo_1966_ND_16.jpg,Document,"The Michael Collins Papers (Ms1989-029)",1,0
5167,https://digitalsc.lib.vt.edu/items/show/5167,"Photograph, S-66-39717, Michael Collins inside the Static Article 5, [Gulf of Mexico], [June 18], 1966 (Ms1989-029)",,"Science and Technology^^Archives of American Aerospace Exploration (AAAE)^^Astronauts^^Project Gemini (U.S.)^^United States. National Aeronautics and Space Administration","Michael Collins inside the Static Article 5 during water egress training onboard the NASA Motor Vessel Retriever.",,,"Collins, Michael, 1930-","<a href=""http://search.vaheritage.org/vivaxtf/view?docId=vt/viblbv00092.xml"" target=""_blank"">See the Finding Aid for the Michael Collins Papers</a>",,1966-06-18,,,,,,,,,,"<a href=""https://digitalsc.lib.vt.edu/files/thumbnails/spec_forms/PubPermission.doc"" target=""_blank"">Permission to publish material from the Michael Collins Papers must be obtained from Special Collections, Virginia Tech.</a>",,,,,,,,,"Ms1989-029, Box 7, Folder 1a",,,,,,,,,,,,Photograph,Ms1989-029_B07_F1a_Photo_1966_ND_01,"Researchers wishing to cite this collection should include the following information: Michael Collins Papers, Ms1989-029, Special Collections, Virginia Polytechnic Institute and State University, Blacksburg, Va.",,,,,,,,,,,,"<a href=""http://spec.lib.vt.edu/"" target=""_blank"">Special Collections, University Libraries, Virginia Tech</a>",,,,,,,,,,,,,,,,,,,,,,,,,,,,,,,,,,,,,,,,,,,,,,,,,,,,,,,,,,,,,,,,,,,,,,,http://spec.lib.vt.edu/pickup/Omeka_upload/Ms1989-029_B07_F1a_Photo_1966_ND_01.jpg,Document,"The Michael Collins Papers (Ms1989-029)",1,0
5237,https://digitalsc.lib.vt.edu/items/show/5237,"Photograph, S-66-34674, Gemini 10 Crew arrive aboad recovery ship , [July 21, 1966] (Ms1989-029)",,"Science and Technology^^Archives of American Aerospace Exploration (AAAE)^^Astronauts^^Project Gemini (U.S.)^^United States. National Aeronautics and Space Administration","The crew of the Gemini 10 Spaceflight, Astronauts John W. Young and Michael Collins, arrive aboard the recovery ship USS Guadalcanal.",,,"Collins, Michael, 1930-","<a href=""http://search.vaheritage.org/vivaxtf/view?docId=vt/viblbv00092.xml"" target=""_blank"">See the Finding Aid for the Michael Collins Papers</a>",,1966-07-21,,,,,,,,,,"<a href=""https://digitalsc.lib.vt.edu/files/thumbnails/spec_forms/PubPermission.doc"" target=""_blank"">Permission to publish material from the Michael Collins Papers must be obtained from Special Collections, Virginia Tech.</a>",,,"<a href=""http://spaceflight.nasa.gov/gallery/images/gemini/"" target=""_blank"">NASA Gemini Gallery</a>",,,,,,"Ms1989-029, Box 7, Folder 1d",,,,,,,,,,,,Photographs,Ms1989-029_B07_F1d_Photo_1966_ND_01,"Researchers wishing to cite this collection should include the following information: Michael Collins Papers, Ms1989-029, Special Collections, Virginia Polytechnic Institute and State University, Blacksburg, Va.",,,,,,,,,,,,"<a href=""http://spec.lib.vt.edu/"" target=""_blank"">Special Collections, University Libraries, Virginia Tech</a>",,,,,,,,,,,,,,,,,,,,,,,,,,,,,,,,,,,,,,,,,,,,,,,,,,,,,,,,,,,,,,,,,,,,,,,http://spec.lib.vt.edu/pickup/Omeka_upload/Ms1989-029_B07_F1d_Photo_1966_ND_01.jpg,Document,"The Michael Collins Papers (Ms1989-029)",1,0
5183,https://digitalsc.lib.vt.edu/items/show/5183,"Photograph, S-66-32549, NASA 904 T-38 jet airplane, 1966 (Ms1989-029)",,"Science and Technology^^Archives of American Aerospace Exploration (AAAE)^^Astronauts^^Project Gemini (U.S.)^^United States. National Aeronautics and Space Administration","NASA Photo S-66-32549. NASA 904, a T-38 jet used by NASA for training missions",,,"Collins, Michael, 1930-","<a href=""http://search.vaheritage.org/vivaxtf/view?docId=vt/viblbv00092.xml"" target=""_blank"">See the Finding Aid for the Michael Collins Papers</a>",,1966,,,,,,,,,,"<a href=""https://digitalsc.lib.vt.edu/files/thumbnails/spec_forms/PubPermission.doc"" target=""_blank"">Permission to publish material from the Michael Collins Papers must be obtained from Special Collections, Virginia Tech.</a>",,,,,,,,,"Ms1989-029, Box 7, Folder 1a",,,,,,,,,,,,,Ms1989-029_B07_F1a_Photo_1966_ND_17,"Researchers wishing to cite this collection should include the following information: Michael Collins Papers, Ms1989-029, Special Collections, Virginia Polytechnic Institute and State University, Blacksburg, Va.",,,,,,,,,,,,"<a href=""http://spec.lib.vt.edu/"" target=""_blank"">Special Collections, University Libraries, Virginia Tech</a>",,,,,,,,,,,,,,,,,,,,,,,,,,,,,,,,,,,,,,,,,,,,,,,,,,,,,,,,,,,,,,,,,,,,,,,http://spec.lib.vt.edu/pickup/Omeka_upload/Ms1989-029_B07_F1a_Photo_1966_ND_17.jpg,Document,"The Michael Collins Papers (Ms1989-029)",1,0