﻿"Item Id","Item URI","Dublin Core:Title","Dublin Core:Alternative Title","Dublin Core:Subject","Dublin Core:Description","Dublin Core:Abstract","Dublin Core:Table Of Contents","Dublin Core:Creator","Dublin Core:Source","Dublin Core:Publisher","Dublin Core:Date","Dublin Core:Date Available","Dublin Core:Date Created","Dublin Core:Date Accepted","Dublin Core:Date Copyrighted","Dublin Core:Date Submitted","Dublin Core:Date Issued","Dublin Core:Date Modified","Dublin Core:Date Valid","Dublin Core:Contributor","Dublin Core:Rights","Dublin Core:Access Rights","Dublin Core:License","Dublin Core:Relation","Dublin Core:Conforms To","Dublin Core:Has Format","Dublin Core:Has Part","Dublin Core:Has Version","Dublin Core:Is Format Of","Dublin Core:Is Part Of","Dublin Core:Is Referenced By","Dublin Core:Is Replaced By","Dublin Core:Is Required By","Dublin Core:Is Version Of","Dublin Core:References","Dublin Core:Replaces","Dublin Core:Requires","Dublin Core:Format","Dublin Core:Extent","Dublin Core:Medium","Dublin Core:Language","Dublin Core:Type","Dublin Core:Identifier","Dublin Core:Bibliographic Citation","Dublin Core:Coverage","Dublin Core:Spatial Coverage","Dublin Core:Temporal Coverage","Dublin Core:Accrual Method","Dublin Core:Accrual Periodicity","Dublin Core:Accrual Policy","Dublin Core:Audience","Dublin Core:Audience Education Level","Dublin Core:Mediator","Dublin Core:Instructional Method","Dublin Core:Provenance","Dublin Core:Rights Holder","Item Type Metadata:Text","Item Type Metadata:Interviewer","Item Type Metadata:Interviewee","Item Type Metadata:Location","Item Type Metadata:Transcription","Item Type Metadata:Local URL","Item Type Metadata:Original Format","Item Type Metadata:Physical Dimensions","Item Type Metadata:Duration","Item Type Metadata:Compression","Item Type Metadata:Producer","Item Type Metadata:Director","Item Type Metadata:Bit Rate/Frequency","Item Type Metadata:Time Summary","Item Type Metadata:Email Body","Item Type Metadata:Subject Line","Item Type Metadata:From","Item Type Metadata:To","Item Type Metadata:CC","Item Type Metadata:BCC","Item Type Metadata:Number of Attachments","Item Type Metadata:Standards","Item Type Metadata:Objectives","Item Type Metadata:Materials","Item Type Metadata:Lesson Plan Text","Item Type Metadata:URL","Item Type Metadata:Event Type","Item Type Metadata:Participants","Item Type Metadata:Birth Date","Item Type Metadata:Birthplace","Item Type Metadata:Death Date","Item Type Metadata:Occupation","Item Type Metadata:Biographical Text","Item Type Metadata:Bibliography","Item Type Metadata:Transcript","Item Type Metadata:Viewer","Item Type Metadata:Player","Item Type Metadata:Frame Rate","Item Type Metadata:Display Resolution","Item Type Metadata:Production Team","Item Type Metadata:Narrator","Omeka Legacy File:Additional Creator","Omeka Legacy File:Transcriber","Omeka Legacy File:Producer","Omeka Legacy File:Render Device","Omeka Legacy File:Render Details","Omeka Legacy File:Capture Date","Omeka Legacy File:Capture Device","Omeka Legacy File:Capture Details","Omeka Legacy File:Change History","Omeka Legacy File:Watermark","Omeka Legacy File:Encryption","Omeka Legacy File:Compression","Omeka Legacy File:Post Processing","Omeka Image File:Width","Omeka Image File:Height","Omeka Image File:Bit Depth","Omeka Image File:Channels","Omeka Image File:Exif String","Omeka Image File:Exif Array","Omeka Image File:IPTC String","Omeka Image File:IPTC Array","Omeka Video File:Bitrate","Omeka Video File:Duration","Omeka Video File:Sample Rate","Omeka Video File:Codec","Omeka Video File:Width","Omeka Video File:Height","PDF Text:Text",tags,file,itemType,collection,public,featured
18409,https://digitalsc.lib.vt.edu/items/show/18409,"Boucher and Ford Quillen",,,"Boucher poses with four other men, including Ford Quillen",,,"Frederick Boucher","<a href=""https://ead.lib.virginia.edu/vivaxtf/view?docId=oai/lib.vt.edu/repositories/2/resources/3585.oai_ead.xml"">See the Finding Aid for the Frederick C. Boucher Papers</a>",,,,,,,,,,,,"<a href=""https://omeka.lib.vt.edu/files/thumbnails/spec_forms/PubPermission.doc"">Permission to publish material from the Frederick C. Boucher Papers must be obtained from Special Collections, Virginia Tech.</a>",,,,,,,,,,,,,,,,,,,,,,2021-048_75_000_074,"Researchers wishing to cite this collection should include the following information: Frederick C. Boucher, Ms2021-048, Special Collections, Virginia Polytechnic Institute and State University, Blacksburg, Va.",,,,,,,,,,,,"<a href=""http://spec.lib.vt.edu/"" target=""_blank"" rel=""noreferrer noopener"">Special Collections, University Libraries, Virginia Tech</a>",,,,,,,,,,,,,,,,,,,,,,,,,,,,,,,,,,,,,,,,,,,,,,,,,,,,,,,,,,,,,,,,,,,,,,,https://digitalsc.lib.vt.edu/files/original/8dea25612dfd3aeef4144137b8a6c63b.jpg,Document,"Rick Boucher Papers (Ms2021-048)",1,0
18478,https://digitalsc.lib.vt.edu/items/show/18478,"Boucher and George W. Bush",,,"A signed photo of Boucher shaking hands with George W. Bush in the Oval Office",,,"Frederick Boucher","<a href=""https://ead.lib.virginia.edu/vivaxtf/view?docId=oai/lib.vt.edu/repositories/2/resources/3585.oai_ead.xml"">See the Finding Aid for the Frederick C. Boucher Papers</a>",,2005,,,,,,,,,,"<a href=""https://omeka.lib.vt.edu/files/thumbnails/spec_forms/PubPermission.doc"">Permission to publish material from the Frederick C. Boucher Papers must be obtained from Special Collections, Virginia Tech.</a>",,,,,,,,,,,,,,,,,,,,,,2021-048_75_000_143,"Researchers wishing to cite this collection should include the following information: Frederick C. Boucher, Ms2021-048, Special Collections, Virginia Polytechnic Institute and State University, Blacksburg, Va.",,,,,,,,,,,,"<a href=""http://spec.lib.vt.edu/"" target=""_blank"" rel=""noreferrer noopener"">Special Collections, University Libraries, Virginia Tech</a>",,,,,,,,,,,,,,,,,,,,,,,,,,,,,,,,,,,,,,,,,,,,,,,,,,,,,,,,,,,,,,,,,,,,,,,https://digitalsc.lib.vt.edu/files/original/368e010316907266a7e9957e079dc0ba.jpg,Document,"Rick Boucher Papers (Ms2021-048)",1,0
18379,https://digitalsc.lib.vt.edu/items/show/18379,"Boucher and Goodlatte",,,"Boucher and Goodlatte on Airforce One",,,"Frederick Boucher","<a href=""https://ead.lib.virginia.edu/vivaxtf/view?docId=oai/lib.vt.edu/repositories/2/resources/3585.oai_ead.xml"">See the Finding Aid for the Frederick C. Boucher Papers</a>",,,,,,,,,,,,"<a href=""https://omeka.lib.vt.edu/files/thumbnails/spec_forms/PubPermission.doc"">Permission to publish material from the Frederick C. Boucher Papers must be obtained from Special Collections, Virginia Tech.</a>",,,,,,,,,,,,,,,,,,,,,,2021-048_75_000_044,"Researchers wishing to cite this collection should include the following information: Frederick C. Boucher, Ms2021-048, Special Collections, Virginia Polytechnic Institute and State University, Blacksburg, Va.",,,,,,,,,,,,"<a href=""http://spec.lib.vt.edu/"" target=""_blank"" rel=""noreferrer noopener"">Special Collections, University Libraries, Virginia Tech</a>",,,,,,,,,,,,,,,,,,,,,,,,,,,,,,,,,,,,,,,,,,,,,,,,,,,,,,,,,,,,,,,,,,,,,,,https://digitalsc.lib.vt.edu/files/original/d3a435e3ae1e256526a591bb27ef3327.jpg,Document,"Rick Boucher Papers (Ms2021-048)",1,0
18380,https://digitalsc.lib.vt.edu/items/show/18380,"Boucher and Goodlatte",,,"Boucher and Goodlatte in Japan",,,"Frederick Boucher","<a href=""https://ead.lib.virginia.edu/vivaxtf/view?docId=oai/lib.vt.edu/repositories/2/resources/3585.oai_ead.xml"">See the Finding Aid for the Frederick C. Boucher Papers</a>",,2000,,,,,,,,,,"<a href=""https://omeka.lib.vt.edu/files/thumbnails/spec_forms/PubPermission.doc"">Permission to publish material from the Frederick C. Boucher Papers must be obtained from Special Collections, Virginia Tech.</a>",,,,,,,,,,,,,,,,,,,,,,2021-048_75_000_045,"Researchers wishing to cite this collection should include the following information: Frederick C. Boucher, Ms2021-048, Special Collections, Virginia Polytechnic Institute and State University, Blacksburg, Va.",,,,,,,,,,,,"<a href=""http://spec.lib.vt.edu/"" target=""_blank"" rel=""noreferrer noopener"">Special Collections, University Libraries, Virginia Tech</a>",,,,,,,,,,,,,,,,,,,,,,,,,,,,,,,,,,,,,,,,,,,,,,,,,,,,,,,,,,,,,,,,,,,,,,,https://digitalsc.lib.vt.edu/files/original/05b4b8feba56c45ae62835630fb52af4.jpg,Document,"Rick Boucher Papers (Ms2021-048)",1,0
18396,https://digitalsc.lib.vt.edu/items/show/18396,"Boucher and Helen Waddell",,,"Boucher speaks with Helen Waddell in Smyth County",,,"Frederick Boucher","<a href=""https://ead.lib.virginia.edu/vivaxtf/view?docId=oai/lib.vt.edu/repositories/2/resources/3585.oai_ead.xml"">See the Finding Aid for the Frederick C. Boucher Papers</a>",,,,,,,,,,,,"<a href=""https://omeka.lib.vt.edu/files/thumbnails/spec_forms/PubPermission.doc"">Permission to publish material from the Frederick C. Boucher Papers must be obtained from Special Collections, Virginia Tech.</a>",,,,,,,,,,,,,,,,,,,,,,2021-048_75_000_061,"Researchers wishing to cite this collection should include the following information: Frederick C. Boucher, Ms2021-048, Special Collections, Virginia Polytechnic Institute and State University, Blacksburg, Va.",,,,,,,,,,,,"<a href=""http://spec.lib.vt.edu/"" target=""_blank"" rel=""noreferrer noopener"">Special Collections, University Libraries, Virginia Tech</a>",,,,,,,,,,,,,,,,,,,,,,,,,,,,,,,,,,,,,,,,,,,,,,,,,,,,,,,,,,,,,,,,,,,,,,,https://digitalsc.lib.vt.edu/files/original/f4ad58901c422b981ba758f3f4219861.jpg,Document,"Rick Boucher Papers (Ms2021-048)",1,0
18444,https://digitalsc.lib.vt.edu/items/show/18444,"Boucher and Joan Mondale",,,"Boucher sits with Joan Mondale during an event",,,"Frederick Boucher","<a href=""https://ead.lib.virginia.edu/vivaxtf/view?docId=oai/lib.vt.edu/repositories/2/resources/3585.oai_ead.xml"">See the Finding Aid for the Frederick C. Boucher Papers</a>",,1982,,,,,,,,,,"<a href=""https://omeka.lib.vt.edu/files/thumbnails/spec_forms/PubPermission.doc"">Permission to publish material from the Frederick C. Boucher Papers must be obtained from Special Collections, Virginia Tech.</a>",,,,,,,,,,,,,,,,,,,,,,2021-048_75_000_109,"Researchers wishing to cite this collection should include the following information: Frederick C. Boucher, Ms2021-048, Special Collections, Virginia Polytechnic Institute and State University, Blacksburg, Va.",,,,,,,,,,,,"<a href=""http://spec.lib.vt.edu/"" target=""_blank"" rel=""noreferrer noopener"">Special Collections, University Libraries, Virginia Tech</a>",,,,,,,,,,,,,,,,,,,,,,,,,,,,,,,,,,,,,,,,,,,,,,,,,,,,,,,,,,,,,,,,,,,,,,,https://digitalsc.lib.vt.edu/files/original/81f31f20f6b4a3e21c81702d339df957.jpg,Document,"Rick Boucher Papers (Ms2021-048)",1,0
18424,https://digitalsc.lib.vt.edu/items/show/18424,"Boucher and John Buchanan",,,"Boucher shakes hands with John Buchanan",,,"Frederick Boucher","<a href=""https://ead.lib.virginia.edu/vivaxtf/view?docId=oai/lib.vt.edu/repositories/2/resources/3585.oai_ead.xml"">See the Finding Aid for the Frederick C. Boucher Papers</a>",,,,,,,,,,,,"<a href=""https://omeka.lib.vt.edu/files/thumbnails/spec_forms/PubPermission.doc"">Permission to publish material from the Frederick C. Boucher Papers must be obtained from Special Collections, Virginia Tech.</a>",,,,,,,,,,,,,,,,,,,,,,2021-048_75_000_089,"Researchers wishing to cite this collection should include the following information: Frederick C. Boucher, Ms2021-048, Special Collections, Virginia Polytechnic Institute and State University, Blacksburg, Va.",,,,,,,,,,,,"<a href=""http://spec.lib.vt.edu/"" target=""_blank"" rel=""noreferrer noopener"">Special Collections, University Libraries, Virginia Tech</a>",,,,,,,,,,,,,,,,,,,,,,,,,,,,,,,,,,,,,,,,,,,,,,,,,,,,,,,,,,,,,,,,,,,,,,,https://digitalsc.lib.vt.edu/files/original/f738f43e2a68de74e29b494088ef1a05.jpg,Document,"Rick Boucher Papers (Ms2021-048)",1,0
18385,https://digitalsc.lib.vt.edu/items/show/18385,"Boucher and John Warner at the White House",,,"Boucher poses with Senator John Warner and two women at an event",,,"Frederick Boucher","<a href=""https://ead.lib.virginia.edu/vivaxtf/view?docId=oai/lib.vt.edu/repositories/2/resources/3585.oai_ead.xml"">See the Finding Aid for the Frederick C. Boucher Papers</a>",,,,,,,,,,,,"<a href=""https://omeka.lib.vt.edu/files/thumbnails/spec_forms/PubPermission.doc"">Permission to publish material from the Frederick C. Boucher Papers must be obtained from Special Collections, Virginia Tech.</a>",,,,,,,,,,,,,,,,,,,,,,2021-048_75_000_050,"Researchers wishing to cite this collection should include the following information: Frederick C. Boucher, Ms2021-048, Special Collections, Virginia Polytechnic Institute and State University, Blacksburg, Va.",,,,,,,,,,,,"<a href=""http://spec.lib.vt.edu/"" target=""_blank"" rel=""noreferrer noopener"">Special Collections, University Libraries, Virginia Tech</a>",,,,,,,,,,,,,,,,,,,,,,,,,,,,,,,,,,,,,,,,,,,,,,,,,,,,,,,,,,,,,,,,,,,,,,,https://digitalsc.lib.vt.edu/files/original/e22483b4e0d44dce90710a50a963dc8e.jpg,Document,"Rick Boucher Papers (Ms2021-048)",1,0
18487,https://digitalsc.lib.vt.edu/items/show/18487,"Boucher and L. F. Payne",,,"Boucher listens to L.F. Payne speak with another man",,,"Frederick Boucher","<a href=""https://ead.lib.virginia.edu/vivaxtf/view?docId=oai/lib.vt.edu/repositories/2/resources/3585.oai_ead.xml"">See the Finding Aid for the Frederick C. Boucher Papers</a>",,,,,,,,,,,,"<a href=""https://omeka.lib.vt.edu/files/thumbnails/spec_forms/PubPermission.doc"">Permission to publish material from the Frederick C. Boucher Papers must be obtained from Special Collections, Virginia Tech.</a>",,,,,,,,,,,,,,,,,,,,,,2021-048_75_000_152,"Researchers wishing to cite this collection should include the following information: Frederick C. Boucher, Ms2021-048, Special Collections, Virginia Polytechnic Institute and State University, Blacksburg, Va.",,,,,,,,,,,,"<a href=""http://spec.lib.vt.edu/"" target=""_blank"" rel=""noreferrer noopener"">Special Collections, University Libraries, Virginia Tech</a>",,,,,,,,,,,,,,,,,,,,,,,,,,,,,,,,,,,,,,,,,,,,,,,,,,,,,,,,,,,,,,,,,,,,,,,https://digitalsc.lib.vt.edu/files/original/2455e21f4934c400cd0cfec7c1255a19.jpg,Document,"Rick Boucher Papers (Ms2021-048)",1,0
18486,https://digitalsc.lib.vt.edu/items/show/18486,"Boucher and Larry King",,,"Boucher and Larry King pose for a photo after an interview",,,"Frederick Boucher","<a href=""https://ead.lib.virginia.edu/vivaxtf/view?docId=oai/lib.vt.edu/repositories/2/resources/3585.oai_ead.xml"">See the Finding Aid for the Frederick C. Boucher Papers</a>",,,,,,,,,,,,"<a href=""https://omeka.lib.vt.edu/files/thumbnails/spec_forms/PubPermission.doc"">Permission to publish material from the Frederick C. Boucher Papers must be obtained from Special Collections, Virginia Tech.</a>",,,,,,,,,,,,,,,,,,,,,,2021-048_75_000_151,"Researchers wishing to cite this collection should include the following information: Frederick C. Boucher, Ms2021-048, Special Collections, Virginia Polytechnic Institute and State University, Blacksburg, Va.",,,,,,,,,,,,"<a href=""http://spec.lib.vt.edu/"" target=""_blank"" rel=""noreferrer noopener"">Special Collections, University Libraries, Virginia Tech</a>",,,,,,,,,,,,,,,,,,,,,,,,,,,,,,,,,,,,,,,,,,,,,,,,,,,,,,,,,,,,,,,,,,,,,,,https://digitalsc.lib.vt.edu/files/original/6d7ce8b671a0106c4182c0cdb20e9957.jpg,Document,"Rick Boucher Papers (Ms2021-048)",1,0
18504,https://digitalsc.lib.vt.edu/items/show/18504,"Boucher and Madison Marye",,,"Boucher talks with Madison Marye, who is sitting on a tractor",,,"Frederick Boucher","<a href=""https://ead.lib.virginia.edu/vivaxtf/view?docId=oai/lib.vt.edu/repositories/2/resources/3585.oai_ead.xml"">See the Finding Aid for the Frederick C. Boucher Papers</a>",,,,,,,,,,,,"<a href=""https://omeka.lib.vt.edu/files/thumbnails/spec_forms/PubPermission.doc"">Permission to publish material from the Frederick C. Boucher Papers must be obtained from Special Collections, Virginia Tech.</a>",,,,,,,,,,,,,,,,,,,,,,2021-048_75_000_169,"Researchers wishing to cite this collection should include the following information: Frederick C. Boucher, Ms2021-048, Special Collections, Virginia Polytechnic Institute and State University, Blacksburg, Va.",,,,,,,,,,,,"<a href=""http://spec.lib.vt.edu/"" target=""_blank"" rel=""noreferrer noopener"">Special Collections, University Libraries, Virginia Tech</a>",,,,,,,,,,,,,,,,,,,,,,,,,,,,,,,,,,,,,,,,,,,,,,,,,,,,,,,,,,,,,,,,,,,,,,,https://digitalsc.lib.vt.edu/files/original/2fcf40ec9a26b53e8274d50ee17b152b.jpg,Document,"Rick Boucher Papers (Ms2021-048)",1,0
18340,https://digitalsc.lib.vt.edu/items/show/18340,"Boucher and Mark Sanford (SC)",,,"Photo of Boucher with Mark Sanford of South Carolina",,,"Frederick Boucher","<a href=""https://ead.lib.virginia.edu/vivaxtf/view?docId=oai/lib.vt.edu/repositories/2/resources/3585.oai_ead.xml"">See the Finding Aid for the Frederick C. Boucher Papers</a>",,,,,,,,,,,,"<a href=""https://omeka.lib.vt.edu/files/thumbnails/spec_forms/PubPermission.doc"">Permission to publish material from the Frederick C. Boucher Papers must be obtained from Special Collections, Virginia Tech.</a>",,,,,,,,,,,,,,,,,,,,,,2021-048_75_000_005,"Researchers wishing to cite this collection should include the following information: Frederick C. Boucher, Ms2021-048, Special Collections, Virginia Polytechnic Institute and State University, Blacksburg, Va.",,,,,,,,,,,,"<a href=""http://spec.lib.vt.edu/"" target=""_blank"" rel=""noreferrer noopener"">Special Collections, University Libraries, Virginia Tech</a>",,,,,,,,,,,,,,,,,,,,,,,,,,,,,,,,,,,,,,,,,,,,,,,,,,,,,,,,,,,,,,,,,,,,,,,https://digitalsc.lib.vt.edu/files/original/d4c4f563c3e9b39c7d152ff16f8cab61.jpg,Document,"Rick Boucher Papers (Ms2021-048)",1,0
18386,https://digitalsc.lib.vt.edu/items/show/18386,"Boucher and Mike Mansfield",,,"Boucher shakes hands with Ambassador to Japan Mike Mansfiled",,,"Frederick Boucher","<a href=""https://ead.lib.virginia.edu/vivaxtf/view?docId=oai/lib.vt.edu/repositories/2/resources/3585.oai_ead.xml"">See the Finding Aid for the Frederick C. Boucher Papers</a>",,,,,,,,,,,,"<a href=""https://omeka.lib.vt.edu/files/thumbnails/spec_forms/PubPermission.doc"">Permission to publish material from the Frederick C. Boucher Papers must be obtained from Special Collections, Virginia Tech.</a>",,,,,,,,,,,,,,,,,,,,,,2021-048_75_000_051,"Researchers wishing to cite this collection should include the following information: Frederick C. Boucher, Ms2021-048, Special Collections, Virginia Polytechnic Institute and State University, Blacksburg, Va.",,,,,,,,,,,,"<a href=""http://spec.lib.vt.edu/"" target=""_blank"" rel=""noreferrer noopener"">Special Collections, University Libraries, Virginia Tech</a>",,,,,,,,,,,,,,,,,,,,,,,,,,,,,,,,,,,,,,,,,,,,,,,,,,,,,,,,,,,,,,,,,,,,,,,https://digitalsc.lib.vt.edu/files/original/81e76a514f2c047ca2c00fb0918f306a.jpg,Document,"Rick Boucher Papers (Ms2021-048)",1,0
18511,https://digitalsc.lib.vt.edu/items/show/18511,"Boucher and Mother",,,"Boucher stands near his seated mother, Dorothy Boucher",,,"Frederick Boucher","<a href=""https://ead.lib.virginia.edu/vivaxtf/view?docId=oai/lib.vt.edu/repositories/2/resources/3585.oai_ead.xml"">See the Finding Aid for the Frederick C. Boucher Papers</a>",,1975,,,,,,,,,,"<a href=""https://omeka.lib.vt.edu/files/thumbnails/spec_forms/PubPermission.doc"">Permission to publish material from the Frederick C. Boucher Papers must be obtained from Special Collections, Virginia Tech.</a>",,,,,,,,,,,,,,,,,,,,,,2021-048_75_000_176,"Researchers wishing to cite this collection should include the following information: Frederick C. Boucher, Ms2021-048, Special Collections, Virginia Polytechnic Institute and State University, Blacksburg, Va.",,,,,,,,,,,,"<a href=""http://spec.lib.vt.edu/"" target=""_blank"" rel=""noreferrer noopener"">Special Collections, University Libraries, Virginia Tech</a>",,,,,,,,,,,,,,,,,,,,,,,,,,,,,,,,,,,,,,,,,,,,,,,,,,,,,,,,,,,,,,,,,,,,,,,https://digitalsc.lib.vt.edu/files/original/d1822b16d1b278c7010231d57febd8a0.jpg,Document,"Rick Boucher Papers (Ms2021-048)",1,0
18480,https://digitalsc.lib.vt.edu/items/show/18480,"Boucher and Obama",,,"Boucher stands by Obama at an event",,,"Frederick Boucher","<a href=""https://ead.lib.virginia.edu/vivaxtf/view?docId=oai/lib.vt.edu/repositories/2/resources/3585.oai_ead.xml"">See the Finding Aid for the Frederick C. Boucher Papers</a>",,,,,,,,,,,,"<a href=""https://omeka.lib.vt.edu/files/thumbnails/spec_forms/PubPermission.doc"">Permission to publish material from the Frederick C. Boucher Papers must be obtained from Special Collections, Virginia Tech.</a>",,,,,,,,,,,,,,,,,,,,,,2021-048_75_000_145,"Researchers wishing to cite this collection should include the following information: Frederick C. Boucher, Ms2021-048, Special Collections, Virginia Polytechnic Institute and State University, Blacksburg, Va.",,,,,,,,,,,,"<a href=""http://spec.lib.vt.edu/"" target=""_blank"" rel=""noreferrer noopener"">Special Collections, University Libraries, Virginia Tech</a>",,,,,,,,,,,,,,,,,,,,,,,,,,,,,,,,,,,,,,,,,,,,,,,,,,,,,,,,,,,,,,,,,,,,,,,https://digitalsc.lib.vt.edu/files/original/2eaea3907a8d35ebc5dde5500e385661.jpg,Document,"Rick Boucher Papers (Ms2021-048)",1,0
18389,https://digitalsc.lib.vt.edu/items/show/18389,"Boucher and Pam Schroeder",,,"A posed group photo of Boucher and Pam Schroeder in Asia",,,"Frederick Boucher","<a href=""https://ead.lib.virginia.edu/vivaxtf/view?docId=oai/lib.vt.edu/repositories/2/resources/3585.oai_ead.xml"">See the Finding Aid for the Frederick C. Boucher Papers</a>",,,,,,,,,,,,"<a href=""https://omeka.lib.vt.edu/files/thumbnails/spec_forms/PubPermission.doc"">Permission to publish material from the Frederick C. Boucher Papers must be obtained from Special Collections, Virginia Tech.</a>",,,,,,,,,,,,,,,,,,,,,,2021-048_75_000_054,"Researchers wishing to cite this collection should include the following information: Frederick C. Boucher, Ms2021-048, Special Collections, Virginia Polytechnic Institute and State University, Blacksburg, Va.",,,,,,,,,,,,"<a href=""http://spec.lib.vt.edu/"" target=""_blank"" rel=""noreferrer noopener"">Special Collections, University Libraries, Virginia Tech</a>",,,,,,,,,,,,,,,,,,,,,,,,,,,,,,,,,,,,,,,,,,,,,,,,,,,,,,,,,,,,,,,,,,,,,,,https://digitalsc.lib.vt.edu/files/original/e215d696f3e5b460863809fefe22da3b.jpg,Document,"Rick Boucher Papers (Ms2021-048)",1,0
18398,https://digitalsc.lib.vt.edu/items/show/18398,"Boucher and Pat Jennings",,,"Boucher stands with Pat Jennings waiting for election returns",,,"Frederick Boucher","<a href=""https://ead.lib.virginia.edu/vivaxtf/view?docId=oai/lib.vt.edu/repositories/2/resources/3585.oai_ead.xml"">See the Finding Aid for the Frederick C. Boucher Papers</a>",,1975,,,,,,,,,,"<a href=""https://omeka.lib.vt.edu/files/thumbnails/spec_forms/PubPermission.doc"">Permission to publish material from the Frederick C. Boucher Papers must be obtained from Special Collections, Virginia Tech.</a>",,,,,,,,,,,,,,,,,,,,,,2021-048_75_000_063,"Researchers wishing to cite this collection should include the following information: Frederick C. Boucher, Ms2021-048, Special Collections, Virginia Polytechnic Institute and State University, Blacksburg, Va.",,,,,,,,,,,,"<a href=""http://spec.lib.vt.edu/"" target=""_blank"" rel=""noreferrer noopener"">Special Collections, University Libraries, Virginia Tech</a>",,,,,,,,,,,,,,,,,,,,,,,,,,,,,,,,,,,,,,,,,,,,,,,,,,,,,,,,,,,,,,,,,,,,,,,https://digitalsc.lib.vt.edu/files/original/3817da5fc8089017e86a87977e397b71.jpg,Document,"Rick Boucher Papers (Ms2021-048)",1,0