﻿"Item Id","Item URI","Dublin Core:Title","Dublin Core:Alternative Title","Dublin Core:Subject","Dublin Core:Description","Dublin Core:Abstract","Dublin Core:Table Of Contents","Dublin Core:Creator","Dublin Core:Source","Dublin Core:Publisher","Dublin Core:Date","Dublin Core:Date Available","Dublin Core:Date Created","Dublin Core:Date Accepted","Dublin Core:Date Copyrighted","Dublin Core:Date Submitted","Dublin Core:Date Issued","Dublin Core:Date Modified","Dublin Core:Date Valid","Dublin Core:Contributor","Dublin Core:Rights","Dublin Core:Access Rights","Dublin Core:License","Dublin Core:Relation","Dublin Core:Conforms To","Dublin Core:Has Format","Dublin Core:Has Part","Dublin Core:Has Version","Dublin Core:Is Format Of","Dublin Core:Is Part Of","Dublin Core:Is Referenced By","Dublin Core:Is Replaced By","Dublin Core:Is Required By","Dublin Core:Is Version Of","Dublin Core:References","Dublin Core:Replaces","Dublin Core:Requires","Dublin Core:Format","Dublin Core:Extent","Dublin Core:Medium","Dublin Core:Language","Dublin Core:Type","Dublin Core:Identifier","Dublin Core:Bibliographic Citation","Dublin Core:Coverage","Dublin Core:Spatial Coverage","Dublin Core:Temporal Coverage","Dublin Core:Accrual Method","Dublin Core:Accrual Periodicity","Dublin Core:Accrual Policy","Dublin Core:Audience","Dublin Core:Audience Education Level","Dublin Core:Mediator","Dublin Core:Instructional Method","Dublin Core:Provenance","Dublin Core:Rights Holder","Item Type Metadata:Text","Item Type Metadata:Interviewer","Item Type Metadata:Interviewee","Item Type Metadata:Location","Item Type Metadata:Transcription","Item Type Metadata:Local URL","Item Type Metadata:Original Format","Item Type Metadata:Physical Dimensions","Item Type Metadata:Duration","Item Type Metadata:Compression","Item Type Metadata:Producer","Item Type Metadata:Director","Item Type Metadata:Bit Rate/Frequency","Item Type Metadata:Time Summary","Item Type Metadata:Email Body","Item Type Metadata:Subject Line","Item Type Metadata:From","Item Type Metadata:To","Item Type Metadata:CC","Item Type Metadata:BCC","Item Type Metadata:Number of Attachments","Item Type Metadata:Standards","Item Type Metadata:Objectives","Item Type Metadata:Materials","Item Type Metadata:Lesson Plan Text","Item Type Metadata:URL","Item Type Metadata:Event Type","Item Type Metadata:Participants","Item Type Metadata:Birth Date","Item Type Metadata:Birthplace","Item Type Metadata:Death Date","Item Type Metadata:Occupation","Item Type Metadata:Biographical Text","Item Type Metadata:Bibliography","Item Type Metadata:Transcript","Item Type Metadata:Viewer","Item Type Metadata:Narrator","Item Type Metadata:Production Team","Item Type Metadata:Display Resolution","Item Type Metadata:Frame Rate","Item Type Metadata:Player","Omeka Legacy File:Additional Creator","Omeka Legacy File:Transcriber","Omeka Legacy File:Producer","Omeka Legacy File:Render Device","Omeka Legacy File:Render Details","Omeka Legacy File:Capture Date","Omeka Legacy File:Capture Device","Omeka Legacy File:Capture Details","Omeka Legacy File:Change History","Omeka Legacy File:Watermark","Omeka Legacy File:Encryption","Omeka Legacy File:Compression","Omeka Legacy File:Post Processing","Omeka Image File:Width","Omeka Image File:Height","Omeka Image File:Bit Depth","Omeka Image File:Channels","Omeka Image File:Exif String","Omeka Image File:Exif Array","Omeka Image File:IPTC String","Omeka Image File:IPTC Array","Omeka Video File:Bitrate","Omeka Video File:Duration","Omeka Video File:Sample Rate","Omeka Video File:Codec","Omeka Video File:Width","Omeka Video File:Height","PDF Text:Text",tags,file,itemType,collection,public,featured
13615,https://digitalsc.lib.vt.edu/items/show/13615,"1985 Comprehensive Plan for Parks",,,"The Roanoke County plan to improve and support parks in the area",,,"Cutler, M. Rupert","<a href=""https://https//ead.lib.virginia.edu/vivaxtf/view?docId=oai/lib.vt.edu/repositories/2/resources/3522.oai_ead.xml;query=cutler;brand=default"">See the Finding Aid for the M. Rupert Cutler Papers</a> ",,"June- July 1995",,,,,,,,,,"<a href=""https://omeka.lib.vt.edu/files/thumbnails/spec_forms/PubPermission.doc"">Permission to publish material from the M. Rupert Cutler Papers must be obtained from Special Collections, Virginia Tech.</a>",,,,,,,,,,,,,,,,,,,,,,2020-005_25_022_001,"Researchers wishing to cite this collection should include the following information: M. Rupert Cutler Papers, Ms2020-005, Special Collections, Virginia Polytechnic Institute and State University, Blacksburg, Va.",,,,,,,,,,,,"<a href=""http://spec.lib.vt.edu/"" target=""_blank"" rel=""noreferrer noopener"">Special Collections, University Libraries, Virginia Tech</a>",,,,,,,,,,,,,,,,,,,,,,,,,,,,,,,,,,,,,,,,,,,,,,,,,,,,,,,,,,,,,,,,,,,,,,,"https://digitalsc.lib.vt.edu/files/original/5c8417c6804b5696995def37c0ba76ec.jpg,https://digitalsc.lib.vt.edu/files/original/6b64122a3735ec2666ca16cb3088ae39.jpg,https://digitalsc.lib.vt.edu/files/original/ab35590dab1ea9ed7ace2e0d4a82c86e.jpg,https://digitalsc.lib.vt.edu/files/original/dab41325c386e1a2df42d0f1cc9f58b8.jpg,https://digitalsc.lib.vt.edu/files/original/f308751a9e536e4b3607ffd6c44670c0.jpg",Document,"M. Rupert Cutler Papers (Ms2020-005)",1,0
13620,https://digitalsc.lib.vt.edu/items/show/13620,"Bid Sheet for Property Auction",,,"A document from a property auction where Cutler bought a parcel of land on behalf of the Appalachian Trail Conference",,,"Cutler, M. Rupert","<a href=""https://https//ead.lib.virginia.edu/vivaxtf/view?docId=oai/lib.vt.edu/repositories/2/resources/3522.oai_ead.xml;query=cutler;brand=default"">See the Finding Aid for the M. Rupert Cutler Papers</a> ",,"Sept.- Dec. 1997",,,,,,,,,,"<a href=""https://omeka.lib.vt.edu/files/thumbnails/spec_forms/PubPermission.doc"">Permission to publish material from the M. Rupert Cutler Papers must be obtained from Special Collections, Virginia Tech.</a>",,,,,,,,,,,,,,,,,,,,,,2020-005_27_022_001,"Researchers wishing to cite this collection should include the following information: M. Rupert Cutler Papers, Ms2020-005, Special Collections, Virginia Polytechnic Institute and State University, Blacksburg, Va.",,,,,,,,,,,,"<a href=""http://spec.lib.vt.edu/"" target=""_blank"" rel=""noreferrer noopener"">Special Collections, University Libraries, Virginia Tech</a>",,,,,,,,,,,,,,,,,,,,,,,,,,,,,,,,,,,,,,,,,,,,,,,,,,,,,,,,,,,,,,,,,,,,,,,https://digitalsc.lib.vt.edu/files/original/d06c11c2aa91bf4b950a4a52b56e9eaa.jpg,Document,"M. Rupert Cutler Papers (Ms2020-005)",1,0
13894,https://digitalsc.lib.vt.edu/items/show/13894,"Blue Ridge Nightline on Explore Park",,,"An interview conducted with Dr. Cutler talking about Explore Park and its services. First aired May 5, 1996.",,,"Cutler, M. Rupert","<a href=""https://https://ead.lib.virginia.edu/vivaxtf/view?docId=oai/lib.vt.edu/repositories/2/resources/3522.oai_ead.xml"">See the finding aid for the M. Rupert Cutler Papers.</a> ",,"May 1996",,,,,,,,,,"<a href=""https://omeka.lib.vt.edu/files/thumbnails/spec_forms/PubPermission.doc"">Permission to publish material from the M. Rupert Cutler Papers must be obtained from Special Collections, Virginia Tech.</a>",,,,,,,,,,,,,,,,,,,,,,2020-005_126_000_003,"Researchers wishing to cite this collection should include the following information: [identification of item], [box], [folder], M. Rupert Cutler Papers, Ms2020-005, Special Collections and University Archives, Virginia Tech, Blacksburg, Va.",,,,,,,,,,,,"<a href=""http://spec.lib.vt.edu/"" target=""_blank"">Special Collections, University Libraries, Virginia Tech</a>",,,,,,,,,,,,,,,,,,,,,,,,,,,,,,,,,,,,AV,,,,,,,,,,,,,,,,,,,,,,,,,,,,,,,,,,,https://digitalsc.lib.vt.edu/files/original/61aa95a78c6d3f2e7a6d1208772beae1.mp4,"Moving Image","M. Rupert Cutler Papers (Ms2020-005)",1,0
13638,https://digitalsc.lib.vt.edu/items/show/13638,"City of Roanoke Water Issue",,,"Dr. Cutler responds to a question about water levels in Spring Hollow",,,"Cutler, M. Rupert","<a href=""https://https//ead.lib.virginia.edu/vivaxtf/view?docId=oai/lib.vt.edu/repositories/2/resources/3522.oai_ead.xml;query=cutler;brand=default"">See the Finding Aid for the M. Rupert Cutler Papers</a> ",,"Jan.- Mar. 2002",,,,,,,,,,"<a href=""https://omeka.lib.vt.edu/files/thumbnails/spec_forms/PubPermission.doc"">Permission to publish material from the M. Rupert Cutler Papers must be obtained from Special Collections, Virginia Tech.</a>",,,,,,,,,,,,,,,,,,,,,,2020-005_36_016_001,"Researchers wishing to cite this collection should include the following information: M. Rupert Cutler Papers, Ms2020-005, Special Collections, Virginia Polytechnic Institute and State University, Blacksburg, Va.",,,,,,,,,,,,"<a href=""http://spec.lib.vt.edu/"" target=""_blank"" rel=""noreferrer noopener"">Special Collections, University Libraries, Virginia Tech</a>",,,,,,,,,,,,,,,,,,,,,,,,,,,,,,,,,,,,,,,,,,,,,,,,,,,,,,,,,,,,,,,,,,,,,,,"https://digitalsc.lib.vt.edu/files/original/c2c9ee61488aa23712eb0c9530850d1c.jpg,https://digitalsc.lib.vt.edu/files/original/3d976c6c7e971bde14fb79ba5ef42e4b.jpg",Document,"M. Rupert Cutler Papers (Ms2020-005)",1,0
13591,https://digitalsc.lib.vt.edu/items/show/13591,"Doing Paperwork",,Photographs,"Dr. Cutler and two other men sit at a table, doing paperwork.",,,"Cutler, M. Rupert","<a href=""https://https//ead.lib.virginia.edu/vivaxtf/view?docId=oai/lib.vt.edu/repositories/2/resources/3522.oai_ead.xml;query=cutler;brand=default"">See the Finding Aid for the M. Rupert Cutler Papers</a> ",,"Apr.- May 1991",,,,,,,,,,"<a href=""https://omeka.lib.vt.edu/files/thumbnails/spec_forms/PubPermission.doc"">Permission to publish material from the M. Rupert Cutler Papers must be obtained from Special Collections, Virginia Tech.</a>",,,,,,,,,,,,,,,,,,,,,,2020-005_18_031_003,"Researchers wishing to cite this collection should include the following information: M. Rupert Cutler Papers, Ms2020-005, Special Collections, Virginia Polytechnic Institute and State University, Blacksburg, Va.",,,,,,,,,,,,"<a href=""http://spec.lib.vt.edu/"" target=""_blank"" rel=""noreferrer noopener"">Special Collections, University Libraries, Virginia Tech</a>",,,,,,,,,,,,,,,,,,,,,,,,,,,,,,,,,,,,,,,,,,,,,,,,,,,,,,,,,,,,,,,,,,,,,,,https://digitalsc.lib.vt.edu/files/original/8e90b413c68abc100367ac2759658bd4.jpg,Document,"M. Rupert Cutler Papers (Ms2020-005)",1,0
13593,https://digitalsc.lib.vt.edu/items/show/13593,"Doing Paperwork",,Photographs,"Dr. Cutler and two other men sit at a table, doing paperwork.",,,"Cutler, M. Rupert","<a href=""https://https//ead.lib.virginia.edu/vivaxtf/view?docId=oai/lib.vt.edu/repositories/2/resources/3522.oai_ead.xml;query=cutler;brand=default"">See the Finding Aid for the M. Rupert Cutler Papers</a> ",,"Apr.- May 1991",,,,,,,,,,"<a href=""https://omeka.lib.vt.edu/files/thumbnails/spec_forms/PubPermission.doc"">Permission to publish material from the M. Rupert Cutler Papers must be obtained from Special Collections, Virginia Tech.</a>",,,,,,,,,,,,,,,,,,,,,,2020-005_18_031_005,"Researchers wishing to cite this collection should include the following information: M. Rupert Cutler Papers, Ms2020-005, Special Collections, Virginia Polytechnic Institute and State University, Blacksburg, Va.",,,,,,,,,,,,"<a href=""http://spec.lib.vt.edu/"" target=""_blank"" rel=""noreferrer noopener"">Special Collections, University Libraries, Virginia Tech</a>",,,,,,,,,,,,,,,,,,,,,,,,,,,,,,,,,,,,,,,,,,,,,,,,,,,,,,,,,,,,,,,,,,,,,,,https://digitalsc.lib.vt.edu/files/original/77b0a90a605c688abbda729a6a9fdd9d.jpg,Document,"M. Rupert Cutler Papers (Ms2020-005)",1,0
13589,https://digitalsc.lib.vt.edu/items/show/13589,"Environmental Discussion on a Patio",,Photographs,"Dr. Cutler sits on a patio with another man, having a discussion about the environment",,,"Cutler, M. Rupert","<a href=""https://https//ead.lib.virginia.edu/vivaxtf/view?docId=oai/lib.vt.edu/repositories/2/resources/3522.oai_ead.xml;query=cutler;brand=default"">See the Finding Aid for the M. Rupert Cutler Papers</a> ",,"Apr.- May 1991",,,,,,,,,,"<a href=""https://omeka.lib.vt.edu/files/thumbnails/spec_forms/PubPermission.doc"">Permission to publish material from the M. Rupert Cutler Papers must be obtained from Special Collections, Virginia Tech.</a>",,,,,,,,,,,,,,,,,,,,,,2020-005_18_031_001,"Researchers wishing to cite this collection should include the following information: M. Rupert Cutler Papers, Ms2020-005, Special Collections, Virginia Polytechnic Institute and State University, Blacksburg, Va.",,,,,,,,,,,,"<a href=""http://spec.lib.vt.edu/"" target=""_blank"" rel=""noreferrer noopener"">Special Collections, University Libraries, Virginia Tech</a>",,,,,,,,,,,,,,,,,,,,,,,,,,,,,,,,,,,,,,,,,,,,,,,,,,,,,,,,,,,,,,,,,,,,,,,https://digitalsc.lib.vt.edu/files/original/c851413d3695804bef2dc8195764b480.jpg,Document,"M. Rupert Cutler Papers (Ms2020-005)",1,0
13590,https://digitalsc.lib.vt.edu/items/show/13590,"Environmental Discussion on a Patio",,Photographs,"Dr. Cutler sits on a patio with another man, having a discussion about the environment",,,"Cutler, M. Rupert","<a href=""https://https//ead.lib.virginia.edu/vivaxtf/view?docId=oai/lib.vt.edu/repositories/2/resources/3522.oai_ead.xml;query=cutler;brand=default"">See the Finding Aid for the M. Rupert Cutler Papers</a> ",,"Apr.- May 1991",,,,,,,,,,"<a href=""https://omeka.lib.vt.edu/files/thumbnails/spec_forms/PubPermission.doc"">Permission to publish material from the M. Rupert Cutler Papers must be obtained from Special Collections, Virginia Tech.</a>",,,,,,,,,,,,,,,,,,,,,,2020-005_18_031_002,"Researchers wishing to cite this collection should include the following information: M. Rupert Cutler Papers, Ms2020-005, Special Collections, Virginia Polytechnic Institute and State University, Blacksburg, Va.",,,,,,,,,,,,"<a href=""http://spec.lib.vt.edu/"" target=""_blank"" rel=""noreferrer noopener"">Special Collections, University Libraries, Virginia Tech</a>",,,,,,,,,,,,,,,,,,,,,,,,,,,,,,,,,,,,,,,,,,,,,,,,,,,,,,,,,,,,,,,,,,,,,,,https://digitalsc.lib.vt.edu/files/original/59c6d54a62a50bea3153b2e38b60c3c9.jpg,Document,"M. Rupert Cutler Papers (Ms2020-005)",1,0
13602,https://digitalsc.lib.vt.edu/items/show/13602,"Explore Park Advocacy",,,"A marked-up copy of a Roanoke City Council meeting agenda where Dr. Cutler gave updates about Explore Park and solicited support for the project.",,,"Cutler, M. Rupert","<a href=""https://https//ead.lib.virginia.edu/vivaxtf/view?docId=oai/lib.vt.edu/repositories/2/resources/3522.oai_ead.xml;query=cutler;brand=default"">See the Finding Aid for the M. Rupert Cutler Papers</a> ",,"Sept.- Oct. 1991",,,,,,,,,,"<a href=""https://omeka.lib.vt.edu/files/thumbnails/spec_forms/PubPermission.doc"">Permission to publish material from the M. Rupert Cutler Papers must be obtained from Special Collections, Virginia Tech.</a>",,,,,,,,,,,,,,,,,,,,,,2020-005_19_012_001,"Researchers wishing to cite this collection should include the following information: M. Rupert Cutler Papers, Ms2020-005, Special Collections, Virginia Polytechnic Institute and State University, Blacksburg, Va.",,,,,,,,,,,,"<a href=""http://spec.lib.vt.edu/"" target=""_blank"" rel=""noreferrer noopener"">Special Collections, University Libraries, Virginia Tech</a>",,,,,,,,,,,,,,,,,,,,,,,,,,,,,,,,,,,,,,,,,,,,,,,,,,,,,,,,,,,,,,,,,,,,,,,"https://digitalsc.lib.vt.edu/files/original/1f6758021c0a0f31657269f05dd20ee9.jpg,https://digitalsc.lib.vt.edu/files/original/fa9f0e594a5fe650764228d8903c7e19.jpg,https://digitalsc.lib.vt.edu/files/original/470e7c3e6f3263a312e5edc2862f4ed5.jpg,https://digitalsc.lib.vt.edu/files/original/193f52fb33f2846afe860146dc717b41.jpg,https://digitalsc.lib.vt.edu/files/original/4b15f0044becb8f4046b9eb11fde8869.jpg,https://digitalsc.lib.vt.edu/files/original/7f507eeda339b338b4f5ef22b2d93ffd.jpg,https://digitalsc.lib.vt.edu/files/original/84f4214983ec2b445df2c42664af2e08.jpg",Document,"M. Rupert Cutler Papers (Ms2020-005)",1,0
13594,https://digitalsc.lib.vt.edu/items/show/13594,"Explore Park Mission Statement",,,"The original mission statement for the Lewis and Clark Center at Explore Park",,,"Cutler, M. Rupert","<a href=""https://https//ead.lib.virginia.edu/vivaxtf/view?docId=oai/lib.vt.edu/repositories/2/resources/3522.oai_ead.xml;query=cutler;brand=default"">See the Finding Aid for the M. Rupert Cutler Papers</a> ",,"Apr.- May 1991",,,,,,,,,,"<a href=""https://omeka.lib.vt.edu/files/thumbnails/spec_forms/PubPermission.doc"">Permission to publish material from the M. Rupert Cutler Papers must be obtained from Special Collections, Virginia Tech.</a>",,,,,,,,,,,,,,,,,,,,,,2020-005_18_037_001,"Researchers wishing to cite this collection should include the following information: M. Rupert Cutler Papers, Ms2020-005, Special Collections, Virginia Polytechnic Institute and State University, Blacksburg, Va.",,,,,,,,,,,,"<a href=""http://spec.lib.vt.edu/"" target=""_blank"" rel=""noreferrer noopener"">Special Collections, University Libraries, Virginia Tech</a>",,,,,,,,,,,,,,,,,,,,,,,,,,,,,,,,,,,,,,,,,,,,,,,,,,,,,,,,,,,,,,,,,,,,,,,"https://digitalsc.lib.vt.edu/files/original/b3e9bfa9506608764c6d06de0d14fd98.jpg,https://digitalsc.lib.vt.edu/files/original/f211050795c7871750cc7226b234d834.jpg,https://digitalsc.lib.vt.edu/files/original/1e6a9dd75b2d48cd28edd33ad2160a62.jpg,https://digitalsc.lib.vt.edu/files/original/f7b9d0f15bc01366d897fa9d1a1979e1.jpg,https://digitalsc.lib.vt.edu/files/original/fe831d1a3a67d905a1f12a72795aa04d.jpg,https://digitalsc.lib.vt.edu/files/original/21cca82b992a4aa01ccc5256a554055e.jpg,https://digitalsc.lib.vt.edu/files/original/841b419259fe74e4c81ed7acffde0f49.jpg,https://digitalsc.lib.vt.edu/files/original/3c504b183c74924547aa1d86c19d7f5c.jpg",Document,"M. Rupert Cutler Papers (Ms2020-005)",1,0
13610,https://digitalsc.lib.vt.edu/items/show/13610,"Explore Park Open House for Educators Pamphlet",,,"A pamphlet produced by Explore Park for an event to encourage teachers to bring their classes to the park.",,,"Cutler, M. Rupert","<a href=""https://https//ead.lib.virginia.edu/vivaxtf/view?docId=oai/lib.vt.edu/repositories/2/resources/3522.oai_ead.xml;query=cutler;brand=default"">See the Finding Aid for the M. Rupert Cutler Papers</a> ",,"Feb.- Apr. 1992",,,,,,,,,,"<a href=""https://omeka.lib.vt.edu/files/thumbnails/spec_forms/PubPermission.doc"">Permission to publish material from the M. Rupert Cutler Papers must be obtained from Special Collections, Virginia Tech.</a>",,,,,,,,,,,,,,,,,,,,,,2020-005_20_006_002,"Researchers wishing to cite this collection should include the following information: M. Rupert Cutler Papers, Ms2020-005, Special Collections, Virginia Polytechnic Institute and State University, Blacksburg, Va.",,,,,,,,,,,,"<a href=""http://spec.lib.vt.edu/"" target=""_blank"" rel=""noreferrer noopener"">Special Collections, University Libraries, Virginia Tech</a>",,,,,,,,,,,,,,,,,,,,,,,,,,,,,,,,,,,,,,,,,,,,,,,,,,,,,,,,,,,,,,,,,,,,,,,"https://digitalsc.lib.vt.edu/files/original/23220713e8ceea4d0af89a39788956d4.jpg,https://digitalsc.lib.vt.edu/files/original/efa41483e51ced577d988e175e38828c.jpg",Document,"M. Rupert Cutler Papers (Ms2020-005)",1,0
13609,https://digitalsc.lib.vt.edu/items/show/13609,"Explore Park Presentation ",,,"A letter thanking Dr. Cutler for presenting a plan to bring school children to Explore Park to the Roanoke County School Administration",,,"Cutler, M. Rupert","<a href=""https://https//ead.lib.virginia.edu/vivaxtf/view?docId=oai/lib.vt.edu/repositories/2/resources/3522.oai_ead.xml;query=cutler;brand=default"">See the Finding Aid for the M. Rupert Cutler Papers</a> ",,"Feb.- Apr. 1992",,,,,,,,,,"<a href=""https://omeka.lib.vt.edu/files/thumbnails/spec_forms/PubPermission.doc"">Permission to publish material from the M. Rupert Cutler Papers must be obtained from Special Collections, Virginia Tech.</a>",,,,,,,,,,,,,,,,,,,,,,2020-005_20_006_001,"Researchers wishing to cite this collection should include the following information: M. Rupert Cutler Papers, Ms2020-005, Special Collections, Virginia Polytechnic Institute and State University, Blacksburg, Va.",,,,,,,,,,,,"<a href=""http://spec.lib.vt.edu/"" target=""_blank"" rel=""noreferrer noopener"">Special Collections, University Libraries, Virginia Tech</a>",,,,,,,,,,,,,,,,,,,,,,,,,,,,,,,,,,,,,,,,,,,,,,,,,,,,,,,,,,,,,,,,,,,,,,,https://digitalsc.lib.vt.edu/files/original/2925c037255ad80e6a75365bd100848b.jpg,Document,"M. Rupert Cutler Papers (Ms2020-005)",1,0
13895,https://digitalsc.lib.vt.edu/items/show/13895,"Explore Park Spring 1992",,,"A video taken of site selection and barn raising on Explore Park property in Spring of 1992.",,,"Cutler, M. Rupert","<a href=""https://https://ead.lib.virginia.edu/vivaxtf/view?docId=oai/lib.vt.edu/repositories/2/resources/3522.oai_ead.xml"">See the finding aid for the M. Rupert Cutler Papers.</a> ",,1992,,,,,,,,,,"<a href=""https://omeka.lib.vt.edu/files/thumbnails/spec_forms/PubPermission.doc"">Permission to publish material from the M. Rupert Cutler Papers must be obtained from Special Collections, Virginia Tech.</a>",,,,,,,,,,,,,,,,,,,,,,2020-005_126_000_004,"Researchers wishing to cite this collection should include the following information: [identification of item], [box], [folder], M. Rupert Cutler Papers, Ms2020-005, Special Collections and University Archives, Virginia Tech, Blacksburg, Va.",,,,,,,,,,,,"<a href=""http://spec.lib.vt.edu/"" target=""_blank"">Special Collections, University Libraries, Virginia Tech</a>",,,,,,,,,,,,,,,,,,,,,,,,,,,,,,,,,,,,AV,,,,,,,,,,,,,,,,,,,,,,,,,,,,,,,,,,,https://digitalsc.lib.vt.edu/files/original/e4b1a9cca1c72fa1c911f286cde1cc14.mp4,"Moving Image","M. Rupert Cutler Papers (Ms2020-005)",1,0
13613,https://digitalsc.lib.vt.edu/items/show/13613,"Explore Park Testimony",,,"A marked-up version of the testimony given by Dr. Cutler to the House Appropriations and Senate Finance Committees in support of Explore Park",,,"Cutler, M. Rupert","<a href=""https://https//ead.lib.virginia.edu/vivaxtf/view?docId=oai/lib.vt.edu/repositories/2/resources/3522.oai_ead.xml;query=cutler;brand=default"">See the Finding Aid for the M. Rupert Cutler Papers</a> ",,"Nov. 1995- Jan. 1996",,,,,,,,,,"<a href=""https://omeka.lib.vt.edu/files/thumbnails/spec_forms/PubPermission.doc"">Permission to publish material from the M. Rupert Cutler Papers must be obtained from Special Collections, Virginia Tech.</a>",,,,,,,,,,,,,,,,,,,,,,2020-005_25_017_002,"Researchers wishing to cite this collection should include the following information: M. Rupert Cutler Papers, Ms2020-005, Special Collections, Virginia Polytechnic Institute and State University, Blacksburg, Va.",,,,,,,,,,,,"<a href=""http://spec.lib.vt.edu/"" target=""_blank"" rel=""noreferrer noopener"">Special Collections, University Libraries, Virginia Tech</a>",,,,,,,,,,,,,,,,,,,,,,,,,,,,,,,,,,,,,,,,,,,,,,,,,,,,,,,,,,,,,,,,,,,,,,,"https://digitalsc.lib.vt.edu/files/original/c69a08f1b6af6060b159cd57b17f652e.jpg,https://digitalsc.lib.vt.edu/files/original/ea4a827238bf9daff385655b5eb6b431.jpg",Document,"M. Rupert Cutler Papers (Ms2020-005)",1,0