﻿"Item Id","Item URI","Dublin Core:Title","Dublin Core:Alternative Title","Dublin Core:Subject","Dublin Core:Description","Dublin Core:Abstract","Dublin Core:Table Of Contents","Dublin Core:Creator","Dublin Core:Source","Dublin Core:Publisher","Dublin Core:Date","Dublin Core:Date Available","Dublin Core:Date Created","Dublin Core:Date Accepted","Dublin Core:Date Copyrighted","Dublin Core:Date Submitted","Dublin Core:Date Issued","Dublin Core:Date Modified","Dublin Core:Date Valid","Dublin Core:Contributor","Dublin Core:Rights","Dublin Core:Access Rights","Dublin Core:License","Dublin Core:Relation","Dublin Core:Conforms To","Dublin Core:Has Format","Dublin Core:Has Part","Dublin Core:Has Version","Dublin Core:Is Format Of","Dublin Core:Is Part Of","Dublin Core:Is Referenced By","Dublin Core:Is Replaced By","Dublin Core:Is Required By","Dublin Core:Is Version Of","Dublin Core:References","Dublin Core:Replaces","Dublin Core:Requires","Dublin Core:Format","Dublin Core:Extent","Dublin Core:Medium","Dublin Core:Language","Dublin Core:Type","Dublin Core:Identifier","Dublin Core:Bibliographic Citation","Dublin Core:Coverage","Dublin Core:Spatial Coverage","Dublin Core:Temporal Coverage","Dublin Core:Accrual Method","Dublin Core:Accrual Periodicity","Dublin Core:Accrual Policy","Dublin Core:Audience","Dublin Core:Audience Education Level","Dublin Core:Mediator","Dublin Core:Instructional Method","Dublin Core:Provenance","Dublin Core:Rights Holder","Item Type Metadata:Text","Item Type Metadata:Interviewer","Item Type Metadata:Interviewee","Item Type Metadata:Location","Item Type Metadata:Transcription","Item Type Metadata:Local URL","Item Type Metadata:Original Format","Item Type Metadata:Physical Dimensions","Item Type Metadata:Duration","Item Type Metadata:Compression","Item Type Metadata:Producer","Item Type Metadata:Director","Item Type Metadata:Bit Rate/Frequency","Item Type Metadata:Time Summary","Item Type Metadata:Email Body","Item Type Metadata:Subject Line","Item Type Metadata:From","Item Type Metadata:To","Item Type Metadata:CC","Item Type Metadata:BCC","Item Type Metadata:Number of Attachments","Item Type Metadata:Standards","Item Type Metadata:Objectives","Item Type Metadata:Materials","Item Type Metadata:Lesson Plan Text","Item Type Metadata:URL","Item Type Metadata:Event Type","Item Type Metadata:Participants","Item Type Metadata:Birth Date","Item Type Metadata:Birthplace","Item Type Metadata:Death Date","Item Type Metadata:Occupation","Item Type Metadata:Biographical Text","Item Type Metadata:Bibliography","Item Type Metadata:Transcript","Item Type Metadata:Viewer","Item Type Metadata:Narrator","Item Type Metadata:Production Team","Item Type Metadata:Display Resolution","Item Type Metadata:Frame Rate","Item Type Metadata:Player","Omeka Legacy File:Additional Creator","Omeka Legacy File:Transcriber","Omeka Legacy File:Producer","Omeka Legacy File:Render Device","Omeka Legacy File:Render Details","Omeka Legacy File:Capture Date","Omeka Legacy File:Capture Device","Omeka Legacy File:Capture Details","Omeka Legacy File:Change History","Omeka Legacy File:Watermark","Omeka Legacy File:Encryption","Omeka Legacy File:Compression","Omeka Legacy File:Post Processing","Omeka Image File:Width","Omeka Image File:Height","Omeka Image File:Bit Depth","Omeka Image File:Channels","Omeka Image File:Exif String","Omeka Image File:Exif Array","Omeka Image File:IPTC String","Omeka Image File:IPTC Array","Omeka Video File:Bitrate","Omeka Video File:Duration","Omeka Video File:Sample Rate","Omeka Video File:Codec","Omeka Video File:Width","Omeka Video File:Height","PDF Text:Text",tags,file,itemType,collection,public,featured
5268,https://digitalsc.lib.vt.edu/items/show/5268,"Photogaph, Astronauts Michael Collins and John W. Young walking down the ramp at Pad 19, Gemini 10 Mission, July 18, 1966 (Ms1989-029)",,"Science and Technology^^Archives of American Aerospace Exploration (AAAE)^^Astronauts^^Project Gemini (U.S.)^^United States. National Aeronautics and Space Administration","A fisheye camera lens view of astronauts Michael Collins and John W. Young walking down the ramp at Pad 19.",,,"Collins, Michael, 1930-","<a href=""http://search.vaheritage.org/vivaxtf/view?docId=vt/viblbv00092.xml"" target=""_blank"">See the Finding Aid for the Michael Collins Papers</a>",,1966-07-18,,,,,,,,,,"<a href=""https://digitalsc.lib.vt.edu/files/thumbnails/spec_forms/PubPermission.doc"" target=""_blank"">Permission to publish material from the Michael Collins Papers must be obtained from Special Collections, Virginia Tech.</a>",,,,,,,,,"Ms1989-029, Box 7, Folder 1e",,,,,,,,,,,,Photographs,Ms1989-029_B07_F1e_Slides_1966_01,"Researchers wishing to cite this collection should include the following information: Michael Collins Papers, Ms1989-029, Special Collections, Virginia Polytechnic Institute and State University, Blacksburg, Va.",,,,,,,,,,,,"<a href=""http://spec.lib.vt.edu/"" target=""_blank"">Special Collections, University Libraries, Virginia Tech</a>",,,,,,,,,,,,,,,,,,,,,,,,,,,,,,,,,,,,,,,,,,,,,,,,,,,,,,,,,,,,,,,,,,,,,,,http://spec.lib.vt.edu/pickup/Omeka_upload/Ms1989-029_B07_F1e_Slides_1966_01.jpg,Document,"The Michael Collins Papers (Ms1989-029)",1,0
5272,https://digitalsc.lib.vt.edu/items/show/5272,"Photogaph, The Gemini 10 spacecraft launching from Complex 19, July 18, 1966 (Ms1989-029)",,"Science and Technology^^Archives of American Aerospace Exploration (AAAE)^^Astronauts^^Project Gemini (U.S.)^^United States. National Aeronautics and Space Administration","The Gemini 10 spacecraft launching from Complex 19. A time exposure creates the illusion of multiple rocker arms.",,,"Collins, Michael, 1930-","<a href=""http://search.vaheritage.org/vivaxtf/view?docId=vt/viblbv00092.xml"" target=""_blank"">See the Finding Aid for the Michael Collins Papers</a>",,1966-07-18,,,,,,,,,,"<a href=""https://digitalsc.lib.vt.edu/files/thumbnails/spec_forms/PubPermission.doc"" target=""_blank"">Permission to publish material from the Michael Collins Papers must be obtained from Special Collections, Virginia Tech.</a>",,,,,,,,,"Ms1989-029, Box 7, Folder 1e",,,,,,,,,,,,Photographs,Ms1989-029_B07_F1e_Slides_1966_05,"Researchers wishing to cite this collection should include the following information: Michael Collins Papers, Ms1989-029, Special Collections, Virginia Polytechnic Institute and State University, Blacksburg, Va.",,,,,,,,,,,,"<a href=""http://spec.lib.vt.edu/"" target=""_blank"">Special Collections, University Libraries, Virginia Tech</a>",,,,,,,,,,,,,,,,,,,,,,,,,,,,,,,,,,,,,,,,,,,,,,,,,,,,,,,,,,,,,,,,,,,,,,,http://spec.lib.vt.edu/pickup/Omeka_upload/Ms1989-029_B07_F1e_Slides_1966_05.jpg,Document,"The Michael Collins Papers (Ms1989-029)",1,0
5191,https://digitalsc.lib.vt.edu/items/show/5191,"Photograph, ""Double Launch, Double Exposure"" (CKH7), Gemini 10 Mission, Cape Kennedy, FL, July 18, 1966 (Ms1989-029)",,"Science and Technology^^Archives of American Aerospace Exploration (AAAE)^^Astronauts^^Project Gemini (U.S.)^^United States. National Aeronautics and Space Administration","The Titan 2, carrying the Gemini 10 capsule and astronauts John W. Young and Michael Collins, blasts off from a Cape Kennedy pad in pursuit of an Atlas-Agena launced 101 minutes earlier. The photo is the result of a double exposure.",,,"Collins, Michael, 1930-","<a href=""http://search.vaheritage.org/vivaxtf/view?docId=vt/viblbv00092.xml"" target=""_blank"">See the Finding Aid for the Michael Collins Papers</a>",,1966-07-18,,,,,,,,,,"<a href=""https://digitalsc.lib.vt.edu/files/thumbnails/spec_forms/PubPermission.doc"" target=""_blank"">Permission to publish material from the Michael Collins Papers must be obtained from Special Collections, Virginia Tech.</a>",,,"<a href=""http://spaceflight.nasa.gov/gallery/images/gemini/"" target=""_blank"">NASA Gemini Gallery</a>",,,,,,"Ms1989-029, Box 7, Folder 1b",,,,,,,,,,,,Photographs,Ms1989-029_B07_F1b_Photo_1966_0718_04,"Researchers wishing to cite this collection should include the following information: Michael Collins Papers, Ms1989-029, Special Collections, Virginia Polytechnic Institute and State University, Blacksburg, Va.",,,,,,,,,,,,"<a href=""http://spec.lib.vt.edu/"" target=""_blank"">Special Collections, University Libraries, Virginia Tech</a>",,,,,,,,,,,,,,,,,,,,,,,,,,,,,,,,,,,,,,,,,,,,,,,,,,,,,,,,,,,,,,,,,,,,,,,http://spec.lib.vt.edu/pickup/Omeka_upload/Ms1989-029_B07_F1b_Photo_1966_0718_04.jpg,Document,"The Michael Collins Papers (Ms1989-029)",1,0
5166,https://digitalsc.lib.vt.edu/items/show/5166,"Photograph, ""Getting Ready for a Space Walk (CB-5)"", Gemini 10 Mission, Cape Kennedy, FL, July 18, 1966 (Ms1989-029)",,"Science and Technology^^Archives of American Aerospace Exploration (AAAE)^^Astronauts^^Project Gemini (U.S.)^^United States. National Aeronautics and Space Administration","Michael Collins, who is scheduled to take a walk in space during his three-day flight in Gemini 10 with John W. Young, gets suited up in preparation for his blast-off.",,,"Collins, Michael, 1930-","<a href=""http://search.vaheritage.org/vivaxtf/view?docId=vt/viblbv00092.xml"" target=""_blank"">See the Finding Aid for the Michael Collins Papers</a>",,1966-07-18,,,,,,,,,,"<a href=""https://digitalsc.lib.vt.edu/files/thumbnails/spec_forms/PubPermission.doc"" target=""_blank"">Permission to publish material from the Michael Collins Papers must be obtained from Special Collections, Virginia Tech.</a>",,,,,,,,,"Ms1989-029, Box 7, Folder 1a",,,,,,,,,,,,Photograph,Ms1989-029_B07_F1a_Photo_1966_0718_03,"Researchers wishing to cite this collection should include the following information: Michael Collins Papers, Ms1989-029, Special Collections, Virginia Polytechnic Institute and State University, Blacksburg, Va.",,,,,,,,,,,,"<a href=""http://spec.lib.vt.edu/"" target=""_blank"">Special Collections, University Libraries, Virginia Tech</a>",,,,,,,,,,,,,,,,,,,,,,,,,,,,,,,,,,,,,,,,,,,,,,,,,,,,,,,,,,,,,,,,,,,,,,,http://spec.lib.vt.edu/pickup/Omeka_upload/Ms1989-029_B07_F1a_Photo_1966_0718_03.jpg,Document,"The Michael Collins Papers (Ms1989-029)",1,0
5194,https://digitalsc.lib.vt.edu/items/show/5194,"Photograph, ""How The Gemini Will Get A Boost From Agena"" (CB 10), Gemini 10 Mission, Cape Kennedy, FL, July 18, 1966 (Ms1989-029)",,"Science and Technology^^Archives of American Aerospace Exploration (AAAE)^^Astronauts^^Project Gemini (U.S.)^^United States. National Aeronautics and Space Administration","This is an artist's drawing of how the Gemini 10 space capsule will be pushed into a higher orbit when they ignite the 16,000-pound thrust multi-start Agena rocket engine while docked with the Agena target vehicle.",,,"Collins, Michael, 1930-","<a href=""http://search.vaheritage.org/vivaxtf/view?docId=vt/viblbv00092.xml"" target=""_blank"">See the Finding Aid for the Michael Collins Papers</a>",,1966-07-18,,,,,,,,,,"<a href=""https://digitalsc.lib.vt.edu/files/thumbnails/spec_forms/PubPermission.doc"" target=""_blank"">Permission to publish material from the Michael Collins Papers must be obtained from Special Collections, Virginia Tech.</a>",,,"<a href=""http://spaceflight.nasa.gov/gallery/images/gemini/"" target=""_blank"">NASA Gemini Gallery</a>",,,,,,"Ms1989-029, Box 7, Folder 1b",,,,,,,,,,,,Photographs,Ms1989-029_B07_F1b_Photo_1966_0718_07,"Researchers wishing to cite this collection should include the following information: Michael Collins Papers, Ms1989-029, Special Collections, Virginia Polytechnic Institute and State University, Blacksburg, Va.",,,,,,,,,,,,"<a href=""http://spec.lib.vt.edu/"" target=""_blank"">Special Collections, University Libraries, Virginia Tech</a>",,,,,,,,,,,,,,,,,,,,,,,,,,,,,,,,,,,,,,,,,,,,,,,,,,,,,,,,,,,,,,,,,,,,,,,http://spec.lib.vt.edu/pickup/Omeka_upload/Ms1989-029_B07_F1b_Photo_1966_0718_07.jpg,Document,"The Michael Collins Papers (Ms1989-029)",1,0
5192,https://digitalsc.lib.vt.edu/items/show/5192,"Photograph, ""Off to a Flying Start"" (MSC7), Gemini 10 Mission, Houston, TX, July 18, 1966 (Ms1989-029)",,"Science and Technology^^Archives of American Aerospace Exploration (AAAE)^^Astronauts^^Project Gemini (U.S.)^^United States. National Aeronautics and Space Administration","Mrs. Pat Collins, wife of Air Force Maj. Michael Collins, gestures as she talks with newsmen at the family home in El Lago near the Spacecraft Center following the successful launch.",,,"Collins, Michael, 1930-","<a href=""http://search.vaheritage.org/vivaxtf/view?docId=vt/viblbv00092.xml"" target=""_blank"">See the Finding Aid for the Michael Collins Papers</a>",,1966-07-18,,,,,,,,,,"<a href=""https://digitalsc.lib.vt.edu/files/thumbnails/spec_forms/PubPermission.doc"" target=""_blank"">Permission to publish material from the Michael Collins Papers must be obtained from Special Collections, Virginia Tech.</a>",,,"<a href=""http://spaceflight.nasa.gov/gallery/images/gemini/"" target=""_blank"">NASA Gemini Gallery</a>",,,,,,"Ms1989-029, Box 7, Folder 1b",,,,,,,,,,,,Photographs,Ms1989-029_B07_F1b_Photo_1966_0718_05,"Researchers wishing to cite this collection should include the following information: Michael Collins Papers, Ms1989-029, Special Collections, Virginia Polytechnic Institute and State University, Blacksburg, Va.",,,,,,,,,,,,"<a href=""http://spec.lib.vt.edu/"" target=""_blank"">Special Collections, University Libraries, Virginia Tech</a>",,,,,,,,,,,,,,,,,,,,,,,,,,,,,,,,,,,,,,,,,,,,,,,,,,,,,,,,,,,,,,,,,,,,,,,http://spec.lib.vt.edu/pickup/Omeka_upload/Ms1989-029_B07_F1b_Photo_1966_0718_05.jpg,Document,"The Michael Collins Papers (Ms1989-029)",1,0
5188,https://digitalsc.lib.vt.edu/items/show/5188,"Photograph, ""Ready for Space Voyage"" (CB-8), Gemini 10 Mission, Cape Kennedy, FL, July 18, 1966 (Ms1989-029)",,"Science and Technology^^Archives of American Aerospace Exploration (AAAE)^^Astronauts^^Project Gemini (U.S.)^^United States. National Aeronautics and Space Administration","Locked in their tiny Gemini 10 spacecraft are Astronauts John W. Young and Michael Collins in this unusual ""fisheye"" lens shot of the capsule before the gantry was lowered at Pad 19.",,,"Collins, Michael, 1930-","<a href=""http://search.vaheritage.org/vivaxtf/view?docId=vt/viblbv00092.xml"" target=""_blank"">See the Finding Aid for the Michael Collins Papers</a>",,1966-07-18,,,,,,,,,,"<a href=""https://digitalsc.lib.vt.edu/files/thumbnails/spec_forms/PubPermission.doc"" target=""_blank"">Permission to publish material from the Michael Collins Papers must be obtained from Special Collections, Virginia Tech.</a>",,,"<a href=""http://spaceflight.nasa.gov/gallery/images/gemini/"" target=""_blank"">NASA Gemini Gallery</a>",,,,,,"Ms1989-029, Box 7, Folder 1b",,,,,,,,,,,,Photographs,Ms1989-029_B07_F1b_Photo_1966_0718_01,"Researchers wishing to cite this collection should include the following information: Michael Collins Papers, Ms1989-029, Special Collections, Virginia Polytechnic Institute and State University, Blacksburg, Va.",,,,,,,,,,,,"<a href=""http://spec.lib.vt.edu/"" target=""_blank"">Special Collections, University Libraries, Virginia Tech</a>",,,,,,,,,,,,,,,,,,,,,,,,,,,,,,,,,,,,,,,,,,,,,,,,,,,,,,,,,,,,,,,,,,,,,,,http://spec.lib.vt.edu/pickup/Omeka_upload/Ms1989-029_B07_F1b_Photo_1966_0718_01.jpg,Document,"The Michael Collins Papers (Ms1989-029)",1,0
5193,https://digitalsc.lib.vt.edu/items/show/5193,"Photograph, ""Recovery Forces Watch Launch"" (MSC8), Gemini 10 Mission, Houston, TX, July 18, 1966 (Ms1989-029)",,"Science and Technology^^Archives of American Aerospace Exploration (AAAE)^^Astronauts^^Project Gemini (U.S.)^^United States. National Aeronautics and Space Administration","Members of the Recovery Control Center Staff at Manned Spacecraft Center Houston, TX, watch as Gemini 10 spaceflight begins the roll after launching from Cape Kennedy.",,,"Collins, Michael, 1930-","<a href=""http://search.vaheritage.org/vivaxtf/view?docId=vt/viblbv00092.xml"" target=""_blank"">See the Finding Aid for the Michael Collins Papers</a>",,1966-07-18,,,,,,,,,,"<a href=""https://digitalsc.lib.vt.edu/files/thumbnails/spec_forms/PubPermission.doc"" target=""_blank"">Permission to publish material from the Michael Collins Papers must be obtained from Special Collections, Virginia Tech.</a>",,,"<a href=""http://spaceflight.nasa.gov/gallery/images/gemini/"" target=""_blank"">NASA Gemini Gallery</a>",,,,,,"Ms1989-029, Box 7, Folder 1b",,,,,,,,,,,,Photographs,Ms1989-029_B07_F1b_Photo_1966_0718_06,"Researchers wishing to cite this collection should include the following information: Michael Collins Papers, Ms1989-029, Special Collections, Virginia Polytechnic Institute and State University, Blacksburg, Va.",,,,,,,,,,,,"<a href=""http://spec.lib.vt.edu/"" target=""_blank"">Special Collections, University Libraries, Virginia Tech</a>",,,,,,,,,,,,,,,,,,,,,,,,,,,,,,,,,,,,,,,,,,,,,,,,,,,,,,,,,,,,,,,,,,,,,,,http://spec.lib.vt.edu/pickup/Omeka_upload/Ms1989-029_B07_F1b_Photo_1966_0718_06.jpg,Document,"The Michael Collins Papers (Ms1989-029)",1,0
5164,https://digitalsc.lib.vt.edu/items/show/5164,"Photograph, ""Suited Up and Ready (CB-2)"", Gemini 10 Mission, Cape Kennedy, FL, July 18, 1966 (Ms1989-029)",,"Science and Technology^^Archives of American Aerospace Exploration (AAAE)^^Astronauts^^Project Gemini (U.S.)^^United States. National Aeronautics and Space Administration","Gemini 10 Command Pilot John W. Young leads the way as he and Co-Pilot Michael Collins leave the suiting van at Cape Kennedy, FL.",,,"Collins, Michael, 1930-","<a href=""http://search.vaheritage.org/vivaxtf/view?docId=vt/viblbv00092.xml"" target=""_blank"">See the Finding Aid for the Michael Collins Papers</a>",,1966-07-18,,,,,,,,,,"<a href=""https://digitalsc.lib.vt.edu/files/thumbnails/spec_forms/PubPermission.doc"" target=""_blank"">Permission to publish material from the Michael Collins Papers must be obtained from Special Collections, Virginia Tech.</a>",,,,,,,,,"Ms1989-029, Box 7, Folder 1a",,,,,,,,,,,,Photograph,Ms1989-029_B07_F1a_Photo_1966_0718_01,"Researchers wishing to cite this collection should include the following information: Michael Collins Papers, Ms1989-029, Special Collections, Virginia Polytechnic Institute and State University, Blacksburg, Va.",,,,,,,,,,,,"<a href=""http://spec.lib.vt.edu/"" target=""_blank"">Special Collections, University Libraries, Virginia Tech</a>",,,,,,,,,,,,,,,,,,,,,,,,,,,,,,,,,,,,,,,,,,,,,,,,,,,,,,,,,,,,,,,,,,,,,,,http://spec.lib.vt.edu/pickup/Omeka_upload/Ms1989-029_B07_F1a_Photo_1966_0718_01.jpg,Document,"The Michael Collins Papers (Ms1989-029)",1,0
5190,https://digitalsc.lib.vt.edu/items/show/5190,"Photograph, ""Titan launches voyage of Gemini 10"" (CKH-2), Cape Kennedy, FL, July 18, 1966 (Ms1989-029)",,"Science and Technology^^Archives of American Aerospace Exploration (AAAE)^^Astronauts^^Project Gemini (U.S.)^^United States. National Aeronautics and Space Administration","A Titan 2 rocket lifts from the pad at Cape Kennedy today carrying the Gemini 10 capsule and astronauts John W. Young and Michael Collins to a planned three-day voyage in space.",,,"Collins, Michael, 1930-","<a href=""http://search.vaheritage.org/vivaxtf/view?docId=vt/viblbv00092.xml"" target=""_blank"">See the Finding Aid for the Michael Collins Papers</a>",,1966-07-18,,,,,,,,,,"<a href=""https://digitalsc.lib.vt.edu/files/thumbnails/spec_forms/PubPermission.doc"" target=""_blank"">Permission to publish material from the Michael Collins Papers must be obtained from Special Collections, Virginia Tech.</a>",,,"<a href=""http://spaceflight.nasa.gov/gallery/images/gemini/"" target=""_blank"">NASA Gemini Gallery</a>",,,,,,"Ms1989-029, Box 7, Folder 1b",,,,,,,,,,,,Photographs,Ms1989-029_B07_F1b_Photo_1966_0718_03,"Researchers wishing to cite this collection should include the following information: Michael Collins Papers, Ms1989-029, Special Collections, Virginia Polytechnic Institute and State University, Blacksburg, Va.",,,,,,,,,,,,"<a href=""http://spec.lib.vt.edu/"" target=""_blank"">Special Collections, University Libraries, Virginia Tech</a>",,,,,,,,,,,,,,,,,,,,,,,,,,,,,,,,,,,,,,,,,,,,,,,,,,,,,,,,,,,,,,,,,,,,,,,http://spec.lib.vt.edu/pickup/Omeka_upload/Ms1989-029_B07_F1b_Photo_1966_0718_03.jpg,Document,"The Michael Collins Papers (Ms1989-029)",1,0
5165,https://digitalsc.lib.vt.edu/items/show/5165,"Photograph, ""Too Big to Take Along (CB-7)"", Gemini 10 Mission, Cape Kennedy, FL, July 18, 1966 (Ms1989-029)",,"Science and Technology^^Archives of American Aerospace Exploration (AAAE)^^Astronauts^^Project Gemini (U.S.)^^United States. National Aeronautics and Space Administration","John W. Young, the command pilot of Gemini 10, is presented a huge mock pair of pliers before he and fellow Astronaut Michael Collins boarded their spacecraft.",,,"Collins, Michael, 1930-","<a href=""http://search.vaheritage.org/vivaxtf/view?docId=vt/viblbv00092.xml"" target=""_blank"">See the Finding Aid for the Michael Collins Papers</a>",,1966-07-18,,,,,,,,,,"<a href=""https://digitalsc.lib.vt.edu/files/thumbnails/spec_forms/PubPermission.doc"" target=""_blank"">Permission to publish material from the Michael Collins Papers must be obtained from Special Collections, Virginia Tech.</a>",,,,,,,,,"Ms1989-029, Box 7, Folder 1a",,,,,,,,,,,,Photograph,Ms1989-029_B07_F1a_Photo_1966_0718_02,"Researchers wishing to cite this collection should include the following information: Michael Collins Papers, Ms1989-029, Special Collections, Virginia Polytechnic Institute and State University, Blacksburg, Va.",,,,,,,,,,,,"<a href=""http://spec.lib.vt.edu/"" target=""_blank"">Special Collections, University Libraries, Virginia Tech</a>",,,,,,,,,,,,,,,,,,,,,,,,,,,,,,,,,,,,,,,,,,,,,,,,,,,,,,,,,,,,,,,,,,,,,,,http://spec.lib.vt.edu/pickup/Omeka_upload/Ms1989-029_B07_F1a_Photo_1966_0718_02.jpg,Document,"The Michael Collins Papers (Ms1989-029)",1,0
5189,https://digitalsc.lib.vt.edu/items/show/5189,"Photograph, ""Up and Away"" (CB 4), Gemini 10 Mission, Cape Kennedy, FL, July 18, 1966 (Ms1989-029)",,"Science and Technology^^Archives of American Aerospace Exploration (AAAE)^^Astronauts^^Project Gemini (U.S.)^^United States. National Aeronautics and Space Administration","An Agena space vehicle riding atop a powerful Atlas booster, spewing flames and smoke, rocketed off its pad at Cape Kennedy, FL.",,,"Collins, Michael, 1930-","<a href=""http://search.vaheritage.org/vivaxtf/view?docId=vt/viblbv00092.xml"" target=""_blank"">See the Finding Aid for the Michael Collins Papers</a>",,1966-07-18,,,,,,,,,,"<a href=""https://digitalsc.lib.vt.edu/files/thumbnails/spec_forms/PubPermission.doc"" target=""_blank"">Permission to publish material from the Michael Collins Papers must be obtained from Special Collections, Virginia Tech.</a>",,,"<a href=""http://spaceflight.nasa.gov/gallery/images/gemini/"" target=""_blank"">NASA Gemini Gallery</a>",,,,,,"Ms1989-029, Box 7, Folder 1b",,,,,,,,,,,,Photographs,Ms1989-029_B07_F1b_Photo_1966_0718_02,"Researchers wishing to cite this collection should include the following information: Michael Collins Papers, Ms1989-029, Special Collections, Virginia Polytechnic Institute and State University, Blacksburg, Va.",,,,,,,,,,,,"<a href=""http://spec.lib.vt.edu/"" target=""_blank"">Special Collections, University Libraries, Virginia Tech</a>",,,,,,,,,,,,,,,,,,,,,,,,,,,,,,,,,,,,,,,,,,,,,,,,,,,,,,,,,,,,,,,,,,,,,,,http://spec.lib.vt.edu/pickup/Omeka_upload/Ms1989-029_B07_F1b_Photo_1966_0718_02.jpg,Document,"The Michael Collins Papers (Ms1989-029)",1,0