﻿"Item Id","Item URI","Dublin Core:Title","Dublin Core:Alternative Title","Dublin Core:Subject","Dublin Core:Description","Dublin Core:Abstract","Dublin Core:Table Of Contents","Dublin Core:Creator","Dublin Core:Source","Dublin Core:Publisher","Dublin Core:Date","Dublin Core:Date Available","Dublin Core:Date Created","Dublin Core:Date Accepted","Dublin Core:Date Copyrighted","Dublin Core:Date Submitted","Dublin Core:Date Issued","Dublin Core:Date Modified","Dublin Core:Date Valid","Dublin Core:Contributor","Dublin Core:Rights","Dublin Core:Access Rights","Dublin Core:License","Dublin Core:Relation","Dublin Core:Conforms To","Dublin Core:Has Format","Dublin Core:Has Part","Dublin Core:Has Version","Dublin Core:Is Format Of","Dublin Core:Is Part Of","Dublin Core:Is Referenced By","Dublin Core:Is Replaced By","Dublin Core:Is Required By","Dublin Core:Is Version Of","Dublin Core:References","Dublin Core:Replaces","Dublin Core:Requires","Dublin Core:Format","Dublin Core:Extent","Dublin Core:Medium","Dublin Core:Language","Dublin Core:Type","Dublin Core:Identifier","Dublin Core:Bibliographic Citation","Dublin Core:Coverage","Dublin Core:Spatial Coverage","Dublin Core:Temporal Coverage","Dublin Core:Accrual Method","Dublin Core:Accrual Periodicity","Dublin Core:Accrual Policy","Dublin Core:Audience","Dublin Core:Audience Education Level","Dublin Core:Mediator","Dublin Core:Instructional Method","Dublin Core:Provenance","Dublin Core:Rights Holder","Item Type Metadata:Text","Item Type Metadata:Interviewer","Item Type Metadata:Interviewee","Item Type Metadata:Location","Item Type Metadata:Transcription","Item Type Metadata:Local URL","Item Type Metadata:Original Format","Item Type Metadata:Physical Dimensions","Item Type Metadata:Duration","Item Type Metadata:Compression","Item Type Metadata:Producer","Item Type Metadata:Director","Item Type Metadata:Bit Rate/Frequency","Item Type Metadata:Time Summary","Item Type Metadata:Email Body","Item Type Metadata:Subject Line","Item Type Metadata:From","Item Type Metadata:To","Item Type Metadata:CC","Item Type Metadata:BCC","Item Type Metadata:Number of Attachments","Item Type Metadata:Standards","Item Type Metadata:Objectives","Item Type Metadata:Materials","Item Type Metadata:Lesson Plan Text","Item Type Metadata:URL","Item Type Metadata:Event Type","Item Type Metadata:Participants","Item Type Metadata:Birth Date","Item Type Metadata:Birthplace","Item Type Metadata:Death Date","Item Type Metadata:Occupation","Item Type Metadata:Biographical Text","Item Type Metadata:Bibliography","Item Type Metadata:Transcript","Item Type Metadata:Viewer","Item Type Metadata:Narrator","Item Type Metadata:Production Team","Item Type Metadata:Display Resolution","Item Type Metadata:Frame Rate","Item Type Metadata:Player","Omeka Legacy File:Additional Creator","Omeka Legacy File:Transcriber","Omeka Legacy File:Producer","Omeka Legacy File:Render Device","Omeka Legacy File:Render Details","Omeka Legacy File:Capture Date","Omeka Legacy File:Capture Device","Omeka Legacy File:Capture Details","Omeka Legacy File:Change History","Omeka Legacy File:Watermark","Omeka Legacy File:Encryption","Omeka Legacy File:Compression","Omeka Legacy File:Post Processing","Omeka Image File:Width","Omeka Image File:Height","Omeka Image File:Bit Depth","Omeka Image File:Channels","Omeka Image File:Exif String","Omeka Image File:Exif Array","Omeka Image File:IPTC String","Omeka Image File:IPTC Array","Omeka Video File:Bitrate","Omeka Video File:Duration","Omeka Video File:Sample Rate","Omeka Video File:Codec","Omeka Video File:Width","Omeka Video File:Height","PDF Text:Text",tags,file,itemType,collection,public,featured
18425,https://digitalsc.lib.vt.edu/items/show/18425,"Town Meeting",,,"Boucher speaks at a town meeting while campaigning for State Senate",,,"Frederick Boucher","<a href=""https://ead.lib.virginia.edu/vivaxtf/view?docId=oai/lib.vt.edu/repositories/2/resources/3585.oai_ead.xml"">See the Finding Aid for the Frederick C. Boucher Papers</a>",,1975,,,,,,,,,,"<a href=""https://omeka.lib.vt.edu/files/thumbnails/spec_forms/PubPermission.doc"">Permission to publish material from the Frederick C. Boucher Papers must be obtained from Special Collections, Virginia Tech.</a>",,,,,,,,,,,,,,,,,,,,,,2021-048_75_000_090,"Researchers wishing to cite this collection should include the following information: Frederick C. Boucher, Ms2021-048, Special Collections, Virginia Polytechnic Institute and State University, Blacksburg, Va.",,,,,,,,,,,,"<a href=""http://spec.lib.vt.edu/"" target=""_blank"" rel=""noreferrer noopener"">Special Collections, University Libraries, Virginia Tech</a>",,,,,,,,,,,,,,,,,,,,,,,,,,,,,,,,,,,,,,,,,,,,,,,,,,,,,,,,,,,,,,,,,,,,,,,https://digitalsc.lib.vt.edu/files/original/e5e0d1ee390a3c75de5de9ba9b9c8ad7.jpg,Document,"Rick Boucher Papers (Ms2021-048)",1,0
18419,https://digitalsc.lib.vt.edu/items/show/18419,"Town Meeting",,,"Boucher speaks at a town meeting",,,"Frederick Boucher","<a href=""https://ead.lib.virginia.edu/vivaxtf/view?docId=oai/lib.vt.edu/repositories/2/resources/3585.oai_ead.xml"">See the Finding Aid for the Frederick C. Boucher Papers</a>",,1975,,,,,,,,,,"<a href=""https://omeka.lib.vt.edu/files/thumbnails/spec_forms/PubPermission.doc"">Permission to publish material from the Frederick C. Boucher Papers must be obtained from Special Collections, Virginia Tech.</a>",,,,,,,,,,,,,,,,,,,,,,2021-048_75_000_084,"Researchers wishing to cite this collection should include the following information: Frederick C. Boucher, Ms2021-048, Special Collections, Virginia Polytechnic Institute and State University, Blacksburg, Va.",,,,,,,,,,,,"<a href=""http://spec.lib.vt.edu/"" target=""_blank"" rel=""noreferrer noopener"">Special Collections, University Libraries, Virginia Tech</a>",,,,,,,,,,,,,,,,,,,,,,,,,,,,,,,,,,,,,,,,,,,,,,,,,,,,,,,,,,,,,,,,,,,,,,,https://digitalsc.lib.vt.edu/files/original/22861f315ad864ebcbb844e94763d096.jpg,Document,"Rick Boucher Papers (Ms2021-048)",1,0
9250,https://digitalsc.lib.vt.edu/items/show/9250,"The 1975 Bugle",,"University History",,,,,,,1975,,,,,,,,,,,,,,,,,,,,,,,,,,,,,,,Yearbooks,1975Bugle,,,,,,,,,,,,,,,,,,,,,,,,,,,,,,,,,,,,,,,,,,,,,,,,,PDF,,,,,,,,,,,,,,,,,,,,,,,,,,,,,,,,,,,https://digitalsc.lib.vt.edu/files/original/e4aca8f06a89d226918f67c408aa2268.pdf,Document,<em>Bugles</em>,1,0
18369,https://digitalsc.lib.vt.edu/items/show/18369,"State Senate Campaign in Scott County",,,"Boucher shakes hands with a store owner",,,"Frederick Boucher","<a href=""https://ead.lib.virginia.edu/vivaxtf/view?docId=oai/lib.vt.edu/repositories/2/resources/3585.oai_ead.xml"">See the Finding Aid for the Frederick C. Boucher Papers</a>",,1975,,,,,,,,,,"<a href=""https://omeka.lib.vt.edu/files/thumbnails/spec_forms/PubPermission.doc"">Permission to publish material from the Frederick C. Boucher Papers must be obtained from Special Collections, Virginia Tech.</a>",,,,,,,,,,,,,,,,,,,,,,2021-048_75_000_034,"Researchers wishing to cite this collection should include the following information: Frederick C. Boucher, Ms2021-048, Special Collections, Virginia Polytechnic Institute and State University, Blacksburg, Va.",,,,,,,,,,,,"<a href=""http://spec.lib.vt.edu/"" target=""_blank"" rel=""noreferrer noopener"">Special Collections, University Libraries, Virginia Tech</a>",,,,,,,,,,,,,,,,,,,,,,,,,,,,,,,,,,,,,,,,,,,,,,,,,,,,,,,,,,,,,,,,,,,,,,,https://digitalsc.lib.vt.edu/files/original/f9a701c8e6bf77eba396ce74662376c5.jpg,Document,"Rick Boucher Papers (Ms2021-048)",1,0
18368,https://digitalsc.lib.vt.edu/items/show/18368,"State Senate Campaign in Scott County",,,"Boucher speaks to a grocery shopper",,,"Frederick Boucher","<a href=""https://ead.lib.virginia.edu/vivaxtf/view?docId=oai/lib.vt.edu/repositories/2/resources/3585.oai_ead.xml"">See the Finding Aid for the Frederick C. Boucher Papers</a>",,1975,,,,,,,,,,"<a href=""https://omeka.lib.vt.edu/files/thumbnails/spec_forms/PubPermission.doc"">Permission to publish material from the Frederick C. Boucher Papers must be obtained from Special Collections, Virginia Tech.</a>",,,,,,,,,,,,,,,,,,,,,,2021-048_75_000_033,"Researchers wishing to cite this collection should include the following information: Frederick C. Boucher, Ms2021-048, Special Collections, Virginia Polytechnic Institute and State University, Blacksburg, Va.",,,,,,,,,,,,"<a href=""http://spec.lib.vt.edu/"" target=""_blank"" rel=""noreferrer noopener"">Special Collections, University Libraries, Virginia Tech</a>",,,,,,,,,,,,,,,,,,,,,,,,,,,,,,,,,,,,,,,,,,,,,,,,,,,,,,,,,,,,,,,,,,,,,,,https://digitalsc.lib.vt.edu/files/original/076d7673870da0d46d6444084a629df6.jpg,Document,"Rick Boucher Papers (Ms2021-048)",1,0
18367,https://digitalsc.lib.vt.edu/items/show/18367,"State Senate Campaign in Scott County",,,"Boucher speaks to workers",,,"Frederick Boucher","<a href=""https://ead.lib.virginia.edu/vivaxtf/view?docId=oai/lib.vt.edu/repositories/2/resources/3585.oai_ead.xml"">See the Finding Aid for the Frederick C. Boucher Papers</a>",,1975,,,,,,,,,,"<a href=""https://omeka.lib.vt.edu/files/thumbnails/spec_forms/PubPermission.doc"">Permission to publish material from the Frederick C. Boucher Papers must be obtained from Special Collections, Virginia Tech.</a>",,,,,,,,,,,,,,,,,,,,,,2021-048_75_000_032,"Researchers wishing to cite this collection should include the following information: Frederick C. Boucher, Ms2021-048, Special Collections, Virginia Polytechnic Institute and State University, Blacksburg, Va.",,,,,,,,,,,,"<a href=""http://spec.lib.vt.edu/"" target=""_blank"" rel=""noreferrer noopener"">Special Collections, University Libraries, Virginia Tech</a>",,,,,,,,,,,,,,,,,,,,,,,,,,,,,,,,,,,,,,,,,,,,,,,,,,,,,,,,,,,,,,,,,,,,,,,https://digitalsc.lib.vt.edu/files/original/83ed3c0855dc34a22033dfd5f1cea875.jpg,Document,"Rick Boucher Papers (Ms2021-048)",1,0
18366,https://digitalsc.lib.vt.edu/items/show/18366,"State Senate Campaign in Scott County",,,"Boucher shakes hands with a store owner",,,"Frederick Boucher","<a href=""https://ead.lib.virginia.edu/vivaxtf/view?docId=oai/lib.vt.edu/repositories/2/resources/3585.oai_ead.xml"">See the Finding Aid for the Frederick C. Boucher Papers</a>",,1975,,,,,,,,,,"<a href=""https://omeka.lib.vt.edu/files/thumbnails/spec_forms/PubPermission.doc"">Permission to publish material from the Frederick C. Boucher Papers must be obtained from Special Collections, Virginia Tech.</a>",,,,,,,,,,,,,,,,,,,,,,2021-048_75_000_031,"Researchers wishing to cite this collection should include the following information: Frederick C. Boucher, Ms2021-048, Special Collections, Virginia Polytechnic Institute and State University, Blacksburg, Va.",,,,,,,,,,,,"<a href=""http://spec.lib.vt.edu/"" target=""_blank"" rel=""noreferrer noopener"">Special Collections, University Libraries, Virginia Tech</a>",,,,,,,,,,,,,,,,,,,,,,,,,,,,,,,,,,,,,,,,,,,,,,,,,,,,,,,,,,,,,,,,,,,,,,,https://digitalsc.lib.vt.edu/files/original/996764d624c9443224ceae5efa133a7a.jpg,Document,"Rick Boucher Papers (Ms2021-048)",1,0
18365,https://digitalsc.lib.vt.edu/items/show/18365,"State Senate Campaign in Scott County",,,"Boucher speaks to a store owner",,,"Frederick Boucher","<a href=""https://ead.lib.virginia.edu/vivaxtf/view?docId=oai/lib.vt.edu/repositories/2/resources/3585.oai_ead.xml"">See the Finding Aid for the Frederick C. Boucher Papers</a>",,1975,,,,,,,,,,"<a href=""https://omeka.lib.vt.edu/files/thumbnails/spec_forms/PubPermission.doc"">Permission to publish material from the Frederick C. Boucher Papers must be obtained from Special Collections, Virginia Tech.</a>",,,,,,,,,,,,,,,,,,,,,,2021-048_75_000_030,"Researchers wishing to cite this collection should include the following information: Frederick C. Boucher, Ms2021-048, Special Collections, Virginia Polytechnic Institute and State University, Blacksburg, Va.",,,,,,,,,,,,"<a href=""http://spec.lib.vt.edu/"" target=""_blank"" rel=""noreferrer noopener"">Special Collections, University Libraries, Virginia Tech</a>",,,,,,,,,,,,,,,,,,,,,,,,,,,,,,,,,,,,,,,,,,,,,,,,,,,,,,,,,,,,,,,,,,,,,,,https://digitalsc.lib.vt.edu/files/original/3f3338916bff720a891e8527a3e89c31.jpg,Document,"Rick Boucher Papers (Ms2021-048)",1,0
18364,https://digitalsc.lib.vt.edu/items/show/18364,"State Senate Campaign in Scott County",,,"Boucher speaks to Scott County residents",,,"Frederick Boucher","<a href=""https://ead.lib.virginia.edu/vivaxtf/view?docId=oai/lib.vt.edu/repositories/2/resources/3585.oai_ead.xml"">See the Finding Aid for the Frederick C. Boucher Papers</a>",,1975,,,,,,,,,,"<a href=""https://omeka.lib.vt.edu/files/thumbnails/spec_forms/PubPermission.doc"">Permission to publish material from the Frederick C. Boucher Papers must be obtained from Special Collections, Virginia Tech.</a>",,,,,,,,,,,,,,,,,,,,,,2021-048_75_000_029,"Researchers wishing to cite this collection should include the following information: Frederick C. Boucher, Ms2021-048, Special Collections, Virginia Polytechnic Institute and State University, Blacksburg, Va.",,,,,,,,,,,,"<a href=""http://spec.lib.vt.edu/"" target=""_blank"" rel=""noreferrer noopener"">Special Collections, University Libraries, Virginia Tech</a>",,,,,,,,,,,,,,,,,,,,,,,,,,,,,,,,,,,,,,,,,,,,,,,,,,,,,,,,,,,,,,,,,,,,,,,https://digitalsc.lib.vt.edu/files/original/b21b52aee7f66b768d936672f2ee3b1b.jpg,Document,"Rick Boucher Papers (Ms2021-048)",1,0
18506,https://digitalsc.lib.vt.edu/items/show/18506,"State Senate Campaign",,,"Boucher gives a speech while Andrew Pickens Miller sits nearby",,,"Frederick Boucher","<a href=""https://ead.lib.virginia.edu/vivaxtf/view?docId=oai/lib.vt.edu/repositories/2/resources/3585.oai_ead.xml"">See the Finding Aid for the Frederick C. Boucher Papers</a>",,1975,,,,,,,,,,"<a href=""https://omeka.lib.vt.edu/files/thumbnails/spec_forms/PubPermission.doc"">Permission to publish material from the Frederick C. Boucher Papers must be obtained from Special Collections, Virginia Tech.</a>",,,,,,,,,,,,,,,,,,,,,,2021-048_75_000_171,"Researchers wishing to cite this collection should include the following information: Frederick C. Boucher, Ms2021-048, Special Collections, Virginia Polytechnic Institute and State University, Blacksburg, Va.",,,,,,,,,,,,"<a href=""http://spec.lib.vt.edu/"" target=""_blank"" rel=""noreferrer noopener"">Special Collections, University Libraries, Virginia Tech</a>",,,,,,,,,,,,,,,,,,,,,,,,,,,,,,,,,,,,,,,,,,,,,,,,,,,,,,,,,,,,,,,,,,,,,,,https://digitalsc.lib.vt.edu/files/original/173678a405c0a06cd781f4ec5b4d0518.jpg,Document,"Rick Boucher Papers (Ms2021-048)",1,0
18503,https://digitalsc.lib.vt.edu/items/show/18503,"State Senate Campaign",,,"Boucher speaks to two men during his State Senate campaign",,,"Frederick Boucher","<a href=""https://ead.lib.virginia.edu/vivaxtf/view?docId=oai/lib.vt.edu/repositories/2/resources/3585.oai_ead.xml"">See the Finding Aid for the Frederick C. Boucher Papers</a>",,1975,,,,,,,,,,"<a href=""https://omeka.lib.vt.edu/files/thumbnails/spec_forms/PubPermission.doc"">Permission to publish material from the Frederick C. Boucher Papers must be obtained from Special Collections, Virginia Tech.</a>",,,,,,,,,,,,,,,,,,,,,,2021-048_75_000_168,"Researchers wishing to cite this collection should include the following information: Frederick C. Boucher, Ms2021-048, Special Collections, Virginia Polytechnic Institute and State University, Blacksburg, Va.",,,,,,,,,,,,"<a href=""http://spec.lib.vt.edu/"" target=""_blank"" rel=""noreferrer noopener"">Special Collections, University Libraries, Virginia Tech</a>",,,,,,,,,,,,,,,,,,,,,,,,,,,,,,,,,,,,,,,,,,,,,,,,,,,,,,,,,,,,,,,,,,,,,,,https://digitalsc.lib.vt.edu/files/original/b923a36768d44bd434c51d448d3711bd.jpg,Document,"Rick Boucher Papers (Ms2021-048)",1,0
18502,https://digitalsc.lib.vt.edu/items/show/18502,"State Senate Campaign",,,"Boucher speaks to a man during his State Senate campaign",,,"Frederick Boucher","<a href=""https://ead.lib.virginia.edu/vivaxtf/view?docId=oai/lib.vt.edu/repositories/2/resources/3585.oai_ead.xml"">See the Finding Aid for the Frederick C. Boucher Papers</a>",,1975,,,,,,,,,,"<a href=""https://omeka.lib.vt.edu/files/thumbnails/spec_forms/PubPermission.doc"">Permission to publish material from the Frederick C. Boucher Papers must be obtained from Special Collections, Virginia Tech.</a>",,,,,,,,,,,,,,,,,,,,,,2021-048_75_000_167,"Researchers wishing to cite this collection should include the following information: Frederick C. Boucher, Ms2021-048, Special Collections, Virginia Polytechnic Institute and State University, Blacksburg, Va.",,,,,,,,,,,,"<a href=""http://spec.lib.vt.edu/"" target=""_blank"" rel=""noreferrer noopener"">Special Collections, University Libraries, Virginia Tech</a>",,,,,,,,,,,,,,,,,,,,,,,,,,,,,,,,,,,,,,,,,,,,,,,,,,,,,,,,,,,,,,,,,,,,,,,https://digitalsc.lib.vt.edu/files/original/1c8a5215558aa9bcc05618cd8ca0a985.jpg,Document,"Rick Boucher Papers (Ms2021-048)",1,0
18501,https://digitalsc.lib.vt.edu/items/show/18501,"State Senate Campaign",,,"Boucher speaks to a man during his State Senate campaign",,,"Frederick Boucher","<a href=""https://ead.lib.virginia.edu/vivaxtf/view?docId=oai/lib.vt.edu/repositories/2/resources/3585.oai_ead.xml"">See the Finding Aid for the Frederick C. Boucher Papers</a>",,1975,,,,,,,,,,"<a href=""https://omeka.lib.vt.edu/files/thumbnails/spec_forms/PubPermission.doc"">Permission to publish material from the Frederick C. Boucher Papers must be obtained from Special Collections, Virginia Tech.</a>",,,,,,,,,,,,,,,,,,,,,,2021-048_75_000_166,"Researchers wishing to cite this collection should include the following information: Frederick C. Boucher, Ms2021-048, Special Collections, Virginia Polytechnic Institute and State University, Blacksburg, Va.",,,,,,,,,,,,"<a href=""http://spec.lib.vt.edu/"" target=""_blank"" rel=""noreferrer noopener"">Special Collections, University Libraries, Virginia Tech</a>",,,,,,,,,,,,,,,,,,,,,,,,,,,,,,,,,,,,,,,,,,,,,,,,,,,,,,,,,,,,,,,,,,,,,,,https://digitalsc.lib.vt.edu/files/original/c8828cc996fc8c25f4e16bbc7fda29f5.jpg,Document,"Rick Boucher Papers (Ms2021-048)",1,0
18500,https://digitalsc.lib.vt.edu/items/show/18500,"State Senate Campaign",,,"Boucher speaks with a woman as part of his State Senate Campaign",,,"Frederick Boucher","<a href=""https://ead.lib.virginia.edu/vivaxtf/view?docId=oai/lib.vt.edu/repositories/2/resources/3585.oai_ead.xml"">See the Finding Aid for the Frederick C. Boucher Papers</a>",,1975,,,,,,,,,,"<a href=""https://omeka.lib.vt.edu/files/thumbnails/spec_forms/PubPermission.doc"">Permission to publish material from the Frederick C. Boucher Papers must be obtained from Special Collections, Virginia Tech.</a>",,,,,,,,,,,,,,,,,,,,,,2021-048_75_000_165,"Researchers wishing to cite this collection should include the following information: Frederick C. Boucher, Ms2021-048, Special Collections, Virginia Polytechnic Institute and State University, Blacksburg, Va.",,,,,,,,,,,,"<a href=""http://spec.lib.vt.edu/"" target=""_blank"" rel=""noreferrer noopener"">Special Collections, University Libraries, Virginia Tech</a>",,,,,,,,,,,,,,,,,,,,,,,,,,,,,,,,,,,,,,,,,,,,,,,,,,,,,,,,,,,,,,,,,,,,,,,https://digitalsc.lib.vt.edu/files/original/72cb0b01fdab12fe894d87dd1f1c8806.jpg,Document,"Rick Boucher Papers (Ms2021-048)",1,0
8640,https://digitalsc.lib.vt.edu/items/show/8640,"SquadL, The 1975 Bugle, 328",,"University History",,,,,,,1975,,,,,,,,,,"Permission to publish material from the Virginia Tech Black History Collection must be obtained from Special Collections, Virginia Tech.",,,,,,,,,,,,,,,,,,,,,Clippings,Bugle1975_328_SquadL,,,,,,,,,,,,,,,,,,,,,,,,,,,,,,,,,,,,,,,,,,,,,,,,,,,,,,,,,,,,,,,,,,,,,,,,,,,,,,,,,,,,http://spec.lib.vt.edu/pickup/Omeka_upload/Bugle1975_328_SquadL.jpg,Document,"Black History at Virginia Tech - Firsts in nonBlack Organizations",1,0
22004,https://digitalsc.lib.vt.edu/items/show/22004,"SME Award Presentation",,,"Photo of John Parsons recieving an award from the Society of Mechanical Engineers.",,,"John T. Parsons","<a href=""https://ead.lib.virginia.edu/vivaxtf/view?docId=oai/VT/repositories_2_resources_1459.xml"">See the Finding Aid for the John T. Parsons Papers</a>",,1975,,,,,,,,,,"<a href=""https://omeka.lib.vt.edu/files/thumbnails/spec_forms/PubPermission.doc"">Permission to publish material from the John T. Parsons Papers must be obtained from Special Collections, Virginia Tech.</a>",,,,,,,,,,,,,,,,,,,,,,1987-016_104_025_005,"Researchers wishing to cite this collection should include the following information: The John T. Parsons Papers, Ms1987-016,  Special Collections, Virginia Polytechnic Institute and State University, Blacksburg, Va.",,,,,,,,,,,,"<a href=""http://spec.lib.vt.edu/"" target=""_blank"" rel=""noreferrer noopener"">Special Collections, University Libraries, Virginia Tech</a>",,,,,,,,,,,,,,,,,,,,,,,,,,,,,,,,,,,,,,,,,,,,,,,,,,,,,,,,,,,,,,,,,,,,,,,https://digitalsc.lib.vt.edu/files/original/4b2a4651839022641c9735b2f529525c.tif,"Still Image","John T. Parsons Papers, ca. 1935-1991 (Ms1987-016)",1,0
8889,https://digitalsc.lib.vt.edu/items/show/8889,"Russell Davis, Men's Basketball, the 1975 Bugle, pg 295",,"University History",,,,,,,1975,,,,,,,,,,"Permission to publish material from the Virginia Tech Black History Collection must be obtained from Special Collections, Virginia Tech.",,,,,,,,,,,,,,,,,,,,,Photographs,Bugle1975_pg295_RussellDavis,,,,,,,,,,,,,,,,,,,,,,,,,,,,,,,,,,,,,,,,,,,,,,,,,,,,,,,,,,,,,,,,,,,,,,,,,,,,,,,,,,,,http://spec.lib.vt.edu/pickup/Omeka_upload/Bugle1975_pg295_RussellDavis.jpg,Document,"Black History at Virginia Tech - Athletics",1,0
18412,https://digitalsc.lib.vt.edu/items/show/18412,"Receiving Election Results",,,"Boucher gets news of his Congressional win over the phone",,,"Frederick Boucher","<a href=""https://ead.lib.virginia.edu/vivaxtf/view?docId=oai/lib.vt.edu/repositories/2/resources/3585.oai_ead.xml"">See the Finding Aid for the Frederick C. Boucher Papers</a>",,1975,,,,,,,,,,"<a href=""https://omeka.lib.vt.edu/files/thumbnails/spec_forms/PubPermission.doc"">Permission to publish material from the Frederick C. Boucher Papers must be obtained from Special Collections, Virginia Tech.</a>",,,,,,,,,,,,,,,,,,,,,,2021-048_75_000_077,"Researchers wishing to cite this collection should include the following information: Frederick C. Boucher, Ms2021-048, Special Collections, Virginia Polytechnic Institute and State University, Blacksburg, Va.",,,,,,,,,,,,"<a href=""http://spec.lib.vt.edu/"" target=""_blank"" rel=""noreferrer noopener"">Special Collections, University Libraries, Virginia Tech</a>",,,,,,,,,,,,,,,,,,,,,,,,,,,,,,,,,,,,,,,,,,,,,,,,,,,,,,,,,,,,,,,,,,,,,,,https://digitalsc.lib.vt.edu/files/original/76ea68ab69925247f3cd1e5a4c840657.jpg,Document,"Rick Boucher Papers (Ms2021-048)",1,0
18463,https://digitalsc.lib.vt.edu/items/show/18463,"Presenting a Bill",,,"Boucher holds a copy of a bill being presented to the State Senate",,,"Frederick Boucher","<a href=""https://ead.lib.virginia.edu/vivaxtf/view?docId=oai/lib.vt.edu/repositories/2/resources/3585.oai_ead.xml"">See the Finding Aid for the Frederick C. Boucher Papers</a>",,1975,,,,,,,,,,"<a href=""https://omeka.lib.vt.edu/files/thumbnails/spec_forms/PubPermission.doc"">Permission to publish material from the Frederick C. Boucher Papers must be obtained from Special Collections, Virginia Tech.</a>",,,,,,,,,,,,,,,,,,,,,,2021-048_75_000_128,"Researchers wishing to cite this collection should include the following information: Frederick C. Boucher, Ms2021-048, Special Collections, Virginia Polytechnic Institute and State University, Blacksburg, Va.",,,,,,,,,,,,"<a href=""http://spec.lib.vt.edu/"" target=""_blank"" rel=""noreferrer noopener"">Special Collections, University Libraries, Virginia Tech</a>",,,,,,,,,,,,,,,,,,,,,,,,,,,,,,,,,,,,,,,,,,,,,,,,,,,,,,,,,,,,,,,,,,,,,,,https://digitalsc.lib.vt.edu/files/original/ae01c4ea7f9e5de3be68cc72d854c656.jpg,Document,"Rick Boucher Papers (Ms2021-048)",1,0