﻿"Dublin Core:Title","Dublin Core:Alternative Title","Dublin Core:Subject","Dublin Core:Description","Dublin Core:Abstract","Dublin Core:Table Of Contents","Dublin Core:Creator","Dublin Core:Source","Dublin Core:Publisher","Dublin Core:Date","Dublin Core:Date Available","Dublin Core:Date Created","Dublin Core:Date Accepted","Dublin Core:Date Copyrighted","Dublin Core:Date Submitted","Dublin Core:Date Issued","Dublin Core:Date Modified","Dublin Core:Date Valid","Dublin Core:Contributor","Dublin Core:Rights","Dublin Core:Access Rights","Dublin Core:License","Dublin Core:Relation","Dublin Core:Conforms To","Dublin Core:Has Format","Dublin Core:Has Part","Dublin Core:Has Version","Dublin Core:Is Format Of","Dublin Core:Is Part Of","Dublin Core:Is Referenced By","Dublin Core:Is Replaced By","Dublin Core:Is Required By","Dublin Core:Is Version Of","Dublin Core:References","Dublin Core:Replaces","Dublin Core:Requires","Dublin Core:Format","Dublin Core:Extent","Dublin Core:Medium","Dublin Core:Language","Dublin Core:Type","Dublin Core:Identifier","Dublin Core:Bibliographic Citation","Dublin Core:Coverage","Dublin Core:Spatial Coverage","Dublin Core:Temporal Coverage","Dublin Core:Accrual Method","Dublin Core:Accrual Periodicity","Dublin Core:Accrual Policy","Dublin Core:Audience","Dublin Core:Audience Education Level","Dublin Core:Mediator","Dublin Core:Instructional Method","Dublin Core:Provenance","Dublin Core:Rights Holder","Item Type Metadata:Text","Item Type Metadata:Interviewer","Item Type Metadata:Interviewee","Item Type Metadata:Location","Item Type Metadata:Transcription","Item Type Metadata:Local URL","Item Type Metadata:Original Format","Item Type Metadata:Physical Dimensions","Item Type Metadata:Duration","Item Type Metadata:Compression","Item Type Metadata:Producer","Item Type Metadata:Director","Item Type Metadata:Bit Rate/Frequency","Item Type Metadata:Time Summary","Item Type Metadata:Email Body","Item Type Metadata:Subject Line","Item Type Metadata:From","Item Type Metadata:To","Item Type Metadata:CC","Item Type Metadata:BCC","Item Type Metadata:Number of Attachments","Item Type Metadata:Standards","Item Type Metadata:Objectives","Item Type Metadata:Materials","Item Type Metadata:Lesson Plan Text","Item Type Metadata:URL","Item Type Metadata:Event Type","Item Type Metadata:Participants","Item Type Metadata:Birth Date","Item Type Metadata:Birthplace","Item Type Metadata:Death Date","Item Type Metadata:Occupation","Item Type Metadata:Biographical Text","Item Type Metadata:Bibliography","Item Type Metadata:Transcript","Item Type Metadata:Viewer","Item Type Metadata:Narrator","Item Type Metadata:Production Team","Item Type Metadata:Display Resolution","Item Type Metadata:Frame Rate","Item Type Metadata:Player","Omeka Legacy File:Additional Creator","Omeka Legacy File:Transcriber","Omeka Legacy File:Producer","Omeka Legacy File:Render Device","Omeka Legacy File:Render Details","Omeka Legacy File:Capture Date","Omeka Legacy File:Capture Device","Omeka Legacy File:Capture Details","Omeka Legacy File:Change History","Omeka Legacy File:Watermark","Omeka Legacy File:Encryption","Omeka Legacy File:Compression","Omeka Legacy File:Post Processing","Omeka Image File:Width","Omeka Image File:Height","Omeka Image File:Bit Depth","Omeka Image File:Channels","Omeka Image File:Exif String","Omeka Image File:Exif Array","Omeka Image File:IPTC String","Omeka Image File:IPTC Array","Omeka Video File:Bitrate","Omeka Video File:Duration","Omeka Video File:Sample Rate","Omeka Video File:Codec","Omeka Video File:Width","Omeka Video File:Height","PDF Text:Text",Scripto:Transcription,tags,file,itemType,collection,public,featured
"BOC, The 1989 Bugle, pg271",,"University History",,,,,,,1989,,,,,,,,,,"Permission to publish material from the Virginia Tech Black History Collection must be obtained from Special Collections, Virginia Tech.",,,,,,,,,,,,,,,,,,,,,Clippings,Bugle1989_pg271_BOC_NoDesc,,,,,,,,,,,,,,,,,,,,,,,,,,,,,,,,,,,,,,,,,,,,,,,,,,,,,,,,,,,,,,,,,,,,,,,,,,,,,,,,,,,,,http://spec.lib.vt.edu/pickup/Omeka_upload/Bugle1989_pg271_BOC_NoDesc.jpg,Document,"Black History at Virginia Tech - Black Organizations",1,0
"BOCCoun, The 1989 Bugle, pg268-269",,"University History",,,,,,,1989,,,,,,,,,,"Permission to publish material from the Virginia Tech Black History Collection must be obtained from Special Collections, Virginia Tech.",,,,,,,,,,,,,,,,,,,,,Clippings,Bugle1989_pg268-269_BOCCoun_NoDesc,,,,,,,,,,,,,,,,,,,,,,,,,,,,,,,,,,,,,,,,,,,,,,,,,,,,,,,,,,,,,,,,,,,,,,,,,,,,,,,,,,,,,http://spec.lib.vt.edu/pickup/Omeka_upload/Bugle1989_pg268-269_BOCCoun_NoDesc.jpg,Document,"Black History at Virginia Tech - Black Organizations",1,0
"BOCfull, The 1989 Bugle, pg268-269",,"University History",,,,,,,1989,,,,,,,,,,"Permission to publish material from the Virginia Tech Black History Collection must be obtained from Special Collections, Virginia Tech.",,,,,,,,,,,,,,,,,,,,,Clippings,Bugle1989_pg268-269_BOCfull,,,,,,,,,,,,,,,,,,,,,,,,,,,,,,,,,,,,,,,,,,,,,,,,,,,,,,,,,,,,,,,,,,,,,,,,,,,,,,,,,,,,,http://spec.lib.vt.edu/pickup/Omeka_upload/Bugle1989_pg268-269_BOCfull.jpg,Document,"Black History at Virginia Tech - Black Organizations",1,0
"BOCGreek, The 1989 Bugle, pg268-269",,"University History",,,,,,,1989,,,,,,,,,,"Permission to publish material from the Virginia Tech Black History Collection must be obtained from Special Collections, Virginia Tech.",,,,,,,,,,,,,,,,,,,,,Clippings,Bugle1989_pg268-269_BOCGreek,,,,,,,,,,,,,,,,,,,,,,,,,,,,,,,,,,,,,,,,,,,,,,,,,,,,,,,,,,,,,,,,,,,,,,,,,,,,,,,,,,,,,http://spec.lib.vt.edu/pickup/Omeka_upload/Bugle1989_pg268-269_BOCGreek.jpg,Document,"Black History at Virginia Tech - Black Organizations",1,0
"BOCLead, The 1989 Bugle, pg268-269",,"University History",,,,,,,1989,,,,,,,,,,"Permission to publish material from the Virginia Tech Black History Collection must be obtained from Special Collections, Virginia Tech.",,,,,,,,,,,,,,,,,,,,,Clippings,Bugle1989_pg268-269_BOCLead,,,,,,,,,,,,,,,,,,,,,,,,,,,,,,,,,,,,,,,,,,,,,,,,,,,,,,,,,,,,,,,,,,,,,,,,,,,,,,,,,,,,,http://spec.lib.vt.edu/pickup/Omeka_upload/Bugle1989_pg268-269_BOCLead.jpg,Document,"Black History at Virginia Tech - Black Organizations",1,0
"BOCOff, The 1989 Bugle, pg268-269",,"University History",,,,,,,1989,,,,,,,,,,"Permission to publish material from the Virginia Tech Black History Collection must be obtained from Special Collections, Virginia Tech.",,,,,,,,,,,,,,,,,,,,,Clippings,Bugle1989_pg268-269_BOCOff,,,,,,,,,,,,,,,,,,,,,,,,,,,,,,,,,,,,,,,,,,,,,,,,,,,,,,,,,,,,,,,,,,,,,,,,,,,,,,,,,,,,,http://spec.lib.vt.edu/pickup/Omeka_upload/Bugle1989_pg268-269_BOCOff.jpg,Document,"Black History at Virginia Tech - Black Organizations",1,0
"Boucher and Doug Wilder",,,"A photo of Boucher and Wilder at a campaign event",,,"Frederick Boucher","<a href=""https://ead.lib.virginia.edu/vivaxtf/view?docId=oai/lib.vt.edu/repositories/2/resources/3585.oai_ead.xml"">See the Finding Aid for the Frederick C. Boucher Papers</a>",,1989,,,,,,,,,,"<a href=""https://omeka.lib.vt.edu/files/thumbnails/spec_forms/PubPermission.doc"">Permission to publish material from the Frederick C. Boucher Papers must be obtained from Special Collections, Virginia Tech.</a>",,,,,,,,,,,,,,,,,,,,,,2021-048_75_000_042,"Researchers wishing to cite this collection should include the following information: Frederick C. Boucher, Ms2021-048, Special Collections, Virginia Polytechnic Institute and State University, Blacksburg, Va.",,,,,,,,,,,,"<a href=""http://spec.lib.vt.edu/"" target=""_blank"" rel=""noreferrer noopener"">Special Collections, University Libraries, Virginia Tech</a>",,,,,,,,,,,,,,,,,,,,,,,,,,,,,,,,,,,,,,,,,,,,,,,,,,,,,,,,,,,,,,,,,,,,,,,,http://digitalsc.lib.vt.edu/files/original/e1f28cd9e71434cb5e996ee36628448f.jpg,Document,"Rick Boucher Papers (Ms2021-048)",1,0
"C and P Telephone Plan",,,"Boucher reviews a plan for C and P Telephone with Hugh Stallard during a Showcasing Southwest Virginia visit in Pulaski",,,"Frederick Boucher","<a href=""https://ead.lib.virginia.edu/vivaxtf/view?docId=oai/lib.vt.edu/repositories/2/resources/3585.oai_ead.xml"">See the Finding Aid for the Frederick C. Boucher Papers</a>",,1989,,,,,,,,,,"<a href=""https://omeka.lib.vt.edu/files/thumbnails/spec_forms/PubPermission.doc"">Permission to publish material from the Frederick C. Boucher Papers must be obtained from Special Collections, Virginia Tech.</a>",,,,,,,,,,,,,,,,,,,,,,2021-048_75_000_184,"Researchers wishing to cite this collection should include the following information: Frederick C. Boucher, Ms2021-048, Special Collections, Virginia Polytechnic Institute and State University, Blacksburg, Va.",,,,,,,,,,,,"<a href=""http://spec.lib.vt.edu/"" target=""_blank"" rel=""noreferrer noopener"">Special Collections, University Libraries, Virginia Tech</a>",,,,,,,,,,,,,,,,,,,,,,,,,,,,,,,,,,,,,,,,,,,,,,,,,,,,,,,,,,,,,,,,,,,,,,,,http://digitalsc.lib.vt.edu/files/original/35361b76e1f76d9cbea47bd6212bd593.jpg,Document,"Rick Boucher Papers (Ms2021-048)",1,0
"Christmas Party Picture",,,"Boucher with George H.W. Bush and Barbara Bush at the White House Christmas party",,,"Frederick Boucher","<a href=""https://ead.lib.virginia.edu/vivaxtf/view?docId=oai/lib.vt.edu/repositories/2/resources/3585.oai_ead.xml"">See the Finding Aid for the Frederick C. Boucher Papers</a>",,1989,,,,,,,,,,"<a href=""https://omeka.lib.vt.edu/files/thumbnails/spec_forms/PubPermission.doc"">Permission to publish material from the Frederick C. Boucher Papers must be obtained from Special Collections, Virginia Tech.</a>",,,,,,,,,,,,,,,,,,,,,,2021-048_75_000_141,"Researchers wishing to cite this collection should include the following information: Frederick C. Boucher, Ms2021-048, Special Collections, Virginia Polytechnic Institute and State University, Blacksburg, Va.",,,,,,,,,,,,"<a href=""http://spec.lib.vt.edu/"" target=""_blank"" rel=""noreferrer noopener"">Special Collections, University Libraries, Virginia Tech</a>",,,,,,,,,,,,,,,,,,,,,,,,,,,,,,,,,,,,,,,,,,,,,,,,,,,,,,,,,,,,,,,,,,,,,,,,http://digitalsc.lib.vt.edu/files/original/060b98875bcf2f79e858458992f1af2f.jpg,Document,"Rick Boucher Papers (Ms2021-048)",1,0
"Cornelius Pratt, 1989",,"University History",,,,,,,1989,,,,,,,,,,"Permission to publish material from the Virginia Tech Black History Collection must be obtained from Special Collections, Virginia Tech.",,,,,,,,,,,,,,,,,,,,,Photographs,Pratt_Cornelius_1989_0906,,,,,,,,,,,,,,,,,,,,,,,,,,,,,,,,,,,,,,,,,,,,,,,,,,,,,,,,,,,,,,,,,,,,,,,,,,,,,,,,,,,,,http://spec.lib.vt.edu/pickup/Omeka_upload/Pratt_Cornelius_1989_0906.jpg,Document,"Black History at Virginia Tech - People",1,0
"CSA, The 1989 Bugle, pg236",,"University History",,,,,,,1989,,,,,,,,,,"Permission to publish material from the Virginia Tech Black History Collection must be obtained from Special Collections, Virginia Tech.",,,,,,,,,,,,,,,,,,,,,Clippings,Bugle1989_pg236_CSA,,,,,,,,,,,,,,,,,,,,,,,,,,,,,,,,,,,,,,,,,,,,,,,,,,,,,,,,,,,,,,,,,,,,,,,,,,,,,,,,,,,,,http://spec.lib.vt.edu/pickup/Omeka_upload/Bugle1989_pg236_CSA.jpg,Document,"Black History at Virginia Tech - Firsts in nonBlack Organizations",1,0
"Deborah Parsons, 1989",,"University History",,,,,,,1989,,,,,,,,,,"Permission to publish material from the Virginia Tech Black History Collection must be obtained from Special Collections, Virginia Tech.",,,,,,,,,,,,,,,,,,,,,Photographs,ParsonsDeborah_1989,,,,,,,,,,,,,,,,,,,,,,,,,,,,,,,,,,,,,,,,,,,,,,,,,,,,,,,,,,,,,,,,,,,,,,,,,,,,,,,,,,,,,http://spec.lib.vt.edu/pickup/Omeka_upload/ParsonsDeborah_1989.jpg,Document,"Black History at Virginia Tech - People",1,0
"Dust jacket, <i>Sherwood Anderson: Early Writings</i>",,,,,,,,"Kent, Ohio: Kent State University Press",1989,,,,,,,,,,,,,,,,,,,,,,,,,,,,,,English,"Book jackets",SherwoodAndersonEarlyWritings_1989,,,,,,,,,,,,,,,,,,,,,,,,,,,,,,,,,,,,,,,,,,,,,,,,,,,,,,,,,,,,,,,,,,,,,,,,,,,,,,,,,,,,,http://digitalsc.lib.vt.edu/files/original/156804ae641c0334e047840683d801e6.jpg,"Still Image","Sherwood Anderson Dust Jackets, Covers, & Illustrations",1,0
"Dust jacket, <i>Sherwood Anderson's Love Letters to Eleanor Copenhaver Anderson</i>",,,,,,,,"Athens : University of Georgia Press",1989,,,,,,,,,,,,,,,,,,,,,,,,,,,,,,English,"Book jackets",SherwoodAndersonLoveLetters_1989,,,,,,,,,,,,,,,,,,,,,,,,,,,,,,,,,,,,,,,,,,,,,,,,,,,,,,,,,,,,,,,,,,,,,,,,,,,,,,,,,,,,,http://digitalsc.lib.vt.edu/files/original/4cc0d5ff93484a056bd38be111b719a3.jpg,"Still Image","Sherwood Anderson Dust Jackets, Covers, & Illustrations",1,0
"Josiah Tlou, 1989",,"University History",,,,,,,1989,,,,,,,,,,"Permission to publish material from the Virginia Tech Black History Collection must be obtained from Special Collections, Virginia Tech.",,,,,,,,,,,,,,,,,,,,,Photographs,Tlou_Josiah_1989_1129,,,,,,,,,,,,,,,,,,,,,,,,,,,,,,,,,,,,,,,,,,,,,,,,,,,,,,,,,,,,,,,,,,,,,,,,,,,,,,,,,,,,,http://spec.lib.vt.edu/pickup/Omeka_upload/Tlou_Josiah_1989_1129.jpg,Document,"Black History at Virginia Tech - People",1,0
"Kimble Reynolds, the 1989 Bugle, pg 295",,"University History",,,,,,,1989,,,,,,,,,,"Permission to publish material from the Virginia Tech Black History Collection must be obtained from Special Collections, Virginia Tech.",,,,,,,,,,,,,,,,,,,,,Photographs,Bugle1988_pg295_KimbleReynolds,,,,,,,,,,,,,,,,,,,,,,,,,,,,,,,,,,,,,,,,,,,,,,,,,,,,,,,,,,,,,,,,,,,,,,,,,,,,,,,,,,,,,http://spec.lib.vt.edu/pickup/Omeka_upload/Bugle1988_pg295_KimbleReynolds.jpg,Document,"Black History at Virginia Tech - People",1,0
"Kimble Reynolds, the 1989 Bugle, pg 41",,"University History",,,,,,,1989,,,,,,,,,,"Permission to publish material from the Virginia Tech Black History Collection must be obtained from Special Collections, Virginia Tech.",,,,,,,,,,,,,,,,,,,,,Photographs,Bugle1989_pg41_KimbleReynolds_2,,,,,,,,,,,,,,,,,,,,,,,,,,,,,,,,,,,,,,,,,,,,,,,,,,,,,,,,,,,,,,,,,,,,,,,,,,,,,,,,,,,,,http://spec.lib.vt.edu/pickup/Omeka_upload/Bugle1989_pg41_KimbleReynolds_2.jpg,Document,"Black History at Virginia Tech - People",1,0
"Minority Newsletter, Vol. 5 No. 2, Spring 1989",,"University Archives","Minority Newsletter (continued by Diversity News LD5655 .A76831 D58)",,,,,,1989,,,,,,,,,,"This Item is protected by copyright and/or related rights. You are free to use this Item in any way that is permitted by the copyright and related rights legislation that applies to your use. In addition, no permission is required from the rights-holder(s) for educational uses. For other uses, you need to obtain permission from the rights-holder(s). <a href=""https://rightsstatements.org/page/InC-EDU/1.0/?language=en"" target=""_blank"">https://rightsstatements.org/page/InC-EDU/1.0/?language=en</a>",,,,,,,,,"Minority Newsletter, LD5655 .A76831 M23",,,,,,,,application/pdf,,,English,Newsletters,LD_5655_A76831_M5_V.5_No.2_1989,"Minority Newsletter, [volume, issue, date], Virginia Polytechnic Institute and State University, Blacksburg, Va.",,,,,,,,,,,,"Special Collections and University Archives, Virginia Tech, Blacksburg, Va.",,,,,,,,,,,,,,,,,,,,,,,,,,,,,,,,,,,,PDF,,,,,,,,,,,,,,,,,,,,,,,,,,,,,,,,,,,,http://digitalsc.lib.vt.edu/files/original/021804a0b85d0552078a34c34ed50b85.pdf,Document,"<em>Minority Newsletter</em> and <em>Diversity News</em>",1,0
"Minority Newsletter, Vol. 6 No. 1, Fall 1989",,"University Archives","Minority Newsletter (continued by Diversity News LD5655 .A76831 D58)",,,,,,1989,,,,,,,,,,"This Item is protected by copyright and/or related rights. You are free to use this Item in any way that is permitted by the copyright and related rights legislation that applies to your use. In addition, no permission is required from the rights-holder(s) for educational uses. For other uses, you need to obtain permission from the rights-holder(s). <a href=""https://rightsstatements.org/page/InC-EDU/1.0/?language=en"" target=""_blank"">https://rightsstatements.org/page/InC-EDU/1.0/?language=en</a>",,,,,,,,,"Minority Newsletter, LD5655 .A76831 M24",,,,,,,,application/pdf,,,English,Newsletters,LD_5655_A76831_M5_V.6_No.1_1989,"Minority Newsletter, [volume, issue, date], Virginia Polytechnic Institute and State University, Blacksburg, Va.",,,,,,,,,,,,"Special Collections and University Archives, Virginia Tech, Blacksburg, Va.",,,,,,,,,,,,,,,,,,,,,,,,,,,,,,,,,,,,PDF,,,,,,,,,,,,,,,,,,,,,,,,,,,,,,,,,,,,http://digitalsc.lib.vt.edu/files/original/66f8f49bf584d47e40a7096cd895c628.pdf,Document,"<em>Minority Newsletter</em> and <em>Diversity News</em>",1,0
"NSBE, The 1989 Bugle, pg257",,"University History",,,,,,,1989,,,,,,,,,,"Permission to publish material from the Virginia Tech Black History Collection must be obtained from Special Collections, Virginia Tech.",,,,,,,,,,,,,,,,,,,,,Clippings,Bugle1989_pg257_NSBE,,,,,,,,,,,,,,,,,,,,,,,,,,,,,,,,,,,,,,,,,,,,,,,,,,,,,,,,,,,,,,,,,,,,,,,,,,,,,,,,,,,,,http://spec.lib.vt.edu/pickup/Omeka_upload/Bugle1989_pg257_NSBE.jpg,Document,"Black History at Virginia Tech - Black Organizations",1,0
"OmegaPsiPhi, The 1989 Bugle, pg296",,"University History",,,,,,,1989,,,,,,,,,,"Permission to publish material from the Virginia Tech Black History Collection must be obtained from Special Collections, Virginia Tech.",,,,,,,,,,,,,,,,,,,,,Clippings,Bugle1989_pg296_OmegaPsiPhi_NoDesc,,,,,,,,,,,,,,,,,,,,,,,,,,,,,,,,,,,,,,,,,,,,,,,,,,,,,,,,,,,,,,,,,,,,,,,,,,,,,,,,,,,,,http://spec.lib.vt.edu/pickup/Omeka_upload/Bugle1989_pg296_OmegaPsiPhi_NoDesc.jpg,Document,"Black History at Virginia Tech - Black Organizations",1,0
"Ray Crittenden, 1989",,"University History",,,,,,,1989,,,,,,,,,,"Permission to publish material from the Virginia Tech Black History Collection must be obtained from Special Collections, Virginia Tech.",,,,,,,,,,,,,,,,,,,,,Photographs,CrittendenRay_1989Bugle_pg119,,,,,,,,,,,,,,,,,,,,,,,,,,,,,,,,,,,,,,,,,,,,,,,,,,,,,,,,,,,,,,,,,,,,,,,,,,,,,,,,,,,,,http://spec.lib.vt.edu/pickup/Omeka_upload/CrittendenRay_1989Bugle_pg119.jpg,Document,"Black History at Virginia Tech - Athletics",1,0
"Robert Graham, 1989",,"University History",,,,,,,1989,,,,,,,,,,"Permission to publish material from the Virginia Tech Black History Collection must be obtained from Special Collections, Virginia Tech.",,,,,,,,,,,,,,,,,,,,,Photographs,Graham_Robert_1989,,,,,,,,,,,,,,,,,,,,,,,,,,,,,,,,,,,,,,,,,,,,,,,,,,,,,,,,,,,,,,,,,,,,,,,,,,,,,,,,,,,,,http://spec.lib.vt.edu/pickup/Omeka_upload/Graham_Robert_1989.jpg,Document,"Black History at Virginia Tech - People",1,0
"The 1989 Bugle",,"University History",,,,,,,1989,,,,,,,,,,,,,,,,,,,,,,,,,,,,,,,Yearbooks,1989Bugle,,,,,,,,,,,,,,,,,,,,,,,,,,,,,,,,,,,,,,,,,,,,,,,,,PDF,,,,,,,,,,,,,,,,,,,,,,,,,,,,,,,,,,,,http://digitalsc.lib.vt.edu/files/original/421adb3b997fdc41e4f68bb17ba05bde.pdf,Document,<em>Bugles</em>,1,0
"VTU, The 1989 Bugle, pg229",,"University History",,,,,,,1989,,,,,,,,,,"Permission to publish material from the Virginia Tech Black History Collection must be obtained from Special Collections, Virginia Tech.",,,,,,,,,,,,,,,,,,,,,Clippings,Bugle1989_pg229_VTU_2_NoDescript,,,,,,,,,,,,,,,,,,,,,,,,,,,,,,,,,,,,,,,,,,,,,,,,,,,,,,,,,,,,,,,,,,,,,,,,,,,,,,,,,,,,,http://spec.lib.vt.edu/pickup/Omeka_upload/Bugle1989_pg229_VTU_2_NoDescript.jpg,Document,"Black History at Virginia Tech - Firsts in nonBlack Organizations",1,0
"VTU, The 1989 Bugle, pg229",,"University History",,,,,,,1989,,,,,,,,,,"Permission to publish material from the Virginia Tech Black History Collection must be obtained from Special Collections, Virginia Tech.",,,,,,,,,,,,,,,,,,,,,Clippings,Bugle1989_pg229_VTU_2,,,,,,,,,,,,,,,,,,,,,,,,,,,,,,,,,,,,,,,,,,,,,,,,,,,,,,,,,,,,,,,,,,,,,,,,,,,,,,,,,,,,,http://spec.lib.vt.edu/pickup/Omeka_upload/Bugle1989_pg229_VTU_2.jpg,Document,"Black History at Virginia Tech - Firsts in nonBlack Organizations",1,0
"Walter Lundy, the 1989 Bugle, pg 297",,"University History",,,,,,,1989,,,,,,,,,,"Permission to publish material from the Virginia Tech Black History Collection must be obtained from Special Collections, Virginia Tech.",,,,,,,,,,,,,,,,,,,,,Photographs,Bugle1989_pg297_WalterLundy,,,,,,,,,,,,,,,,,,,,,,,,,,,,,,,,,,,,,,,,,,,,,,,,,,,,,,,,,,,,,,,,,,,,,,,,,,,,,,,,,,,,,http://spec.lib.vt.edu/pickup/Omeka_upload/Bugle1989_pg297_WalterLundy.jpg,Document,"Black History at Virginia Tech - People",1,0
"Willis 'WUVT Willie' Sullivan, the 1989 Bugle, pg 224",,"University History",,,,,,,1989,,,,,,,,,,"Permission to publish material from the Virginia Tech Black History Collection must be obtained from Special Collections, Virginia Tech.",,,,,,,,,,,,,,,,,,,,,Photographs,Bugle1989_pg224-225_WUVT_Willie,,,,,,,,,,,,,,,,,,,,,,,,,,,,,,,,,,,,,,,,,,,,,,,,,,,,,,,,,,,,,,,,,,,,,,,,,,,,,,,,,,,,,http://spec.lib.vt.edu/pickup/Omeka_upload/Bugle1989_pg224-225_WUVT_Willie.jpg,Document,"Black History at Virginia Tech - People",1,0
"WUVT, The 1989 Bugle, pg224-225",,"University History",,,,,,,1989,,,,,,,,,,"Permission to publish material from the Virginia Tech Black History Collection must be obtained from Special Collections, Virginia Tech.",,,,,,,,,,,,,,,,,,,,,Clippings,Bugle1989_pg224-225_WUVT,,,,,,,,,,,,,,,,,,,,,,,,,,,,,,,,,,,,,,,,,,,,,,,,,,,,,,,,,,,,,,,,,,,,,,,,,,,,,,,,,,,,,http://spec.lib.vt.edu/pickup/Omeka_upload/Bugle1989_pg224-225_WUVT.jpg,Document,"Black History at Virginia Tech - Firsts in nonBlack Organizations",1,0
