﻿"Item Id","Item URI","Dublin Core:Title","Dublin Core:Alternative Title","Dublin Core:Subject","Dublin Core:Description","Dublin Core:Abstract","Dublin Core:Table Of Contents","Dublin Core:Creator","Dublin Core:Source","Dublin Core:Publisher","Dublin Core:Date","Dublin Core:Date Available","Dublin Core:Date Created","Dublin Core:Date Accepted","Dublin Core:Date Copyrighted","Dublin Core:Date Submitted","Dublin Core:Date Issued","Dublin Core:Date Modified","Dublin Core:Date Valid","Dublin Core:Contributor","Dublin Core:Rights","Dublin Core:Access Rights","Dublin Core:License","Dublin Core:Relation","Dublin Core:Conforms To","Dublin Core:Has Format","Dublin Core:Has Part","Dublin Core:Has Version","Dublin Core:Is Format Of","Dublin Core:Is Part Of","Dublin Core:Is Referenced By","Dublin Core:Is Replaced By","Dublin Core:Is Required By","Dublin Core:Is Version Of","Dublin Core:References","Dublin Core:Replaces","Dublin Core:Requires","Dublin Core:Format","Dublin Core:Extent","Dublin Core:Medium","Dublin Core:Language","Dublin Core:Type","Dublin Core:Identifier","Dublin Core:Bibliographic Citation","Dublin Core:Coverage","Dublin Core:Spatial Coverage","Dublin Core:Temporal Coverage","Dublin Core:Accrual Method","Dublin Core:Accrual Periodicity","Dublin Core:Accrual Policy","Dublin Core:Audience","Dublin Core:Audience Education Level","Dublin Core:Mediator","Dublin Core:Instructional Method","Dublin Core:Provenance","Dublin Core:Rights Holder","Item Type Metadata:Text","Item Type Metadata:Interviewer","Item Type Metadata:Interviewee","Item Type Metadata:Location","Item Type Metadata:Transcription","Item Type Metadata:Local URL","Item Type Metadata:Original Format","Item Type Metadata:Physical Dimensions","Item Type Metadata:Duration","Item Type Metadata:Compression","Item Type Metadata:Producer","Item Type Metadata:Director","Item Type Metadata:Bit Rate/Frequency","Item Type Metadata:Time Summary","Item Type Metadata:Email Body","Item Type Metadata:Subject Line","Item Type Metadata:From","Item Type Metadata:To","Item Type Metadata:CC","Item Type Metadata:BCC","Item Type Metadata:Number of Attachments","Item Type Metadata:Standards","Item Type Metadata:Objectives","Item Type Metadata:Materials","Item Type Metadata:Lesson Plan Text","Item Type Metadata:URL","Item Type Metadata:Event Type","Item Type Metadata:Participants","Item Type Metadata:Birth Date","Item Type Metadata:Birthplace","Item Type Metadata:Death Date","Item Type Metadata:Occupation","Item Type Metadata:Biographical Text","Item Type Metadata:Bibliography","Item Type Metadata:Transcript","Item Type Metadata:Viewer","Item Type Metadata:Player","Item Type Metadata:Frame Rate","Item Type Metadata:Display Resolution","Item Type Metadata:Production Team","Item Type Metadata:Narrator","Omeka Legacy File:Additional Creator","Omeka Legacy File:Transcriber","Omeka Legacy File:Producer","Omeka Legacy File:Render Device","Omeka Legacy File:Render Details","Omeka Legacy File:Capture Date","Omeka Legacy File:Capture Device","Omeka Legacy File:Capture Details","Omeka Legacy File:Change History","Omeka Legacy File:Watermark","Omeka Legacy File:Encryption","Omeka Legacy File:Compression","Omeka Legacy File:Post Processing","Omeka Image File:Width","Omeka Image File:Height","Omeka Image File:Bit Depth","Omeka Image File:Channels","Omeka Image File:Exif String","Omeka Image File:Exif Array","Omeka Image File:IPTC String","Omeka Image File:IPTC Array","Omeka Video File:Bitrate","Omeka Video File:Duration","Omeka Video File:Sample Rate","Omeka Video File:Codec","Omeka Video File:Width","Omeka Video File:Height","PDF Text:Text",tags,file,itemType,collection,public,featured
13501,https://digitalsc.lib.vt.edu/items/show/13501," Funding Request Day of Rememberance Community Picnic (RG 31/16)",,"Virginia Polytechnic Institute and State University^^University History",,,,"Virginia Polytechnic Institute and State University. Student Government Association.","Virginia Polytechnic Institute and State University. Student Government Association.",,2014,,,,,,,,,,"This Item is protected by copyright and/or related rights. You are free to use this Item in any way that is permitted by the copyright and related rights legislation that applies to your use. In addition, no permission is required from the rights-holder(s) for educational uses. For other uses, you need to obtain permission from the rights-holder(s). <a href=""https://rightsstatements.org/page/InC-EDU/1.0/?language=en"" target=""_blank"" rel=""noreferrer noopener"">https://rightsstatements.org/page/InC-EDU/1.0/?language=en</a>",,,,,,,,,"Student Government Association Records (RG 31/16)",,,,,,,,application/pdf,,,English,,2013-2014_R13FundingRequest_DayofRememberanceCommunityPicnic,"[item], Student Government Association Records (RG 31/16), Special Collections and University Archives, Virginia Tech, Blacksburg, Va.",,,,,,,,,,,,"Special Collections and University Archives, Virginia Tech, Blacksburg, Va.^^Virginia Polytechnic Institute and State University. Student Government Association.",,,,,,,,,,,,,,,,,,,,,,,,,,,,,,,,,,,,PDF,,,,,,,,,,,,,,,,,,,,,,,,,,,,,,,,,,,https://digitalsc.lib.vt.edu/files/original/1fc54abafdaa5e5a767bb599774c193c.pdf,Document,"2013-2014 Legislation (RG 31/16)",1,0
13498,https://digitalsc.lib.vt.edu/items/show/13498," Relay for Life (RG 31/16)",,"Virginia Polytechnic Institute and State University^^University History",,,,"Virginia Polytechnic Institute and State University. Student Government Association.","Virginia Polytechnic Institute and State University. Student Government Association.",,2014,,,,,,,,,,"This Item is protected by copyright and/or related rights. You are free to use this Item in any way that is permitted by the copyright and related rights legislation that applies to your use. In addition, no permission is required from the rights-holder(s) for educational uses. For other uses, you need to obtain permission from the rights-holder(s). <a href=""https://rightsstatements.org/page/InC-EDU/1.0/?language=en"" target=""_blank"" rel=""noreferrer noopener"">https://rightsstatements.org/page/InC-EDU/1.0/?language=en</a>",,,,,,,,,"Student Government Association Records (RG 31/16)",,,,,,,,application/pdf,,,English,,2013-2014_R10RelayforLife,"[item], Student Government Association Records (RG 31/16), Special Collections and University Archives, Virginia Tech, Blacksburg, Va.",,,,,,,,,,,,"Special Collections and University Archives, Virginia Tech, Blacksburg, Va.^^Virginia Polytechnic Institute and State University. Student Government Association.",,,,,,,,,,,,,,,,,,,,,,,,,,,,,,,,,,,,PDF,,,,,,,,,,,,,,,,,,,,,,,,,,,,,,,,,,,https://digitalsc.lib.vt.edu/files/original/8f129771b5de478baaf1b694710c5c1d.pdf,Document,"2013-2014 Legislation (RG 31/16)",1,0
13122,https://digitalsc.lib.vt.edu/items/show/13122,"""Administrative Work at Tech Ordered Reorganized by Board: Visitors Create Committees to Deal with Pressing Problems,"" by Horace Hood, III",,"University Archives^^University History^^Virginia Agricultural and Mechanical College^^Virginia Agricultural and Mechanical College and Polytechnic Institute^^Virginia Polytechnic Institute^^Virginia Polytechnic Institute and State University","Newspaper article, ""Administrative Work at Tech Ordered Reorganized by Board: Visitors Create Committees to Deal with Pressing Problems,"" by Horace Hood, III. This pdf document was created from an existing webpage from the original 125th Anniversary digital exhibit. ",,,"Hood, Horace, III","[Richmond Times?]",,undated,,,,,,,,,,"This item is protected by copyright and/or related rights. You are free to use this Item in any way that is permitted by the copyright and related rights legislation that applies to your use. In addition, no permission is required from the rights-holder(s) for educational uses. For other uses, you need to obtain permission from the rights-holder(s). <a href=""https://rightsstatements.org/page/InC-EDU/1.0/?language=en"" target=""_blank"" rel=""noreferrer noopener"">https://rightsstatements.org/page/InC-EDU/1.0/?language=en</a>",,,,,,,,,"Board of Visitors Collection, 125th Anniversary of Virginia Tech Collection",,,,,,,,application/pdf,,,English,,bov_Hood_AdminWorkReorganized,"Hood, Horace, III. ""Administrative Work at Tech Ordered Reorganized by Board: Visitors Create Committees to Deal with Pressing Problems,"" [Richmond Times?].",,,,,,,,,,,,"[Richmond Times?]",,,,,,,,,,,,,,,,,,,,,,,,,,,,,,,,,,,,PDF,,,,,,,,,,,,,,,,,,,,,,,,,,,,,,,,,,,https://digitalsc.lib.vt.edu/files/original/f3a6e5933891716217d16b25db2e31e4.pdf,Document,"Board of Visitors Collection, 125th Anniversary of Virginia Tech Collection",1,0
13118,https://digitalsc.lib.vt.edu/items/show/13118,"""Confederates in the Collegium: The Influence of J.E.B. Stuart's Leadership on the Development of Virginia Tech,"" by Patrick W. Carlton",,"Virginia Agricultural and Mechanical College^^Virginia Agricultural and Mechanical College and Polytechnic Institute^^University Archives^^University History","This is the pdf of an essay, ""Confederates in the Collegium: The Influence of J.E.B. Stuart's Leadership on the Development of Virginia Tech,"" by Patrick W. Carlton, that was available online. In addition, there is a picture of Patrick W. Carlton, the author. This pdf document was created from an existing webpage from the original 125th Anniversary digital exhibit.",,,"Carlton, Patrick W. ",,,1997?,,,,,,,,,,"This item is protected by copyright and/or related rights. You are free to use this Item in any way that is permitted by the copyright and related rights legislation that applies to your use. In addition, no permission is required from the rights-holder(s) for educational uses. For other uses, you need to obtain permission from the rights-holder(s). <a href=""https://rightsstatements.org/page/InC-EDU/1.0/?language=en"" target=""_blank"">""https://rightsstatements.org/page/InC-EDU/1.0/?language=en</a>",,,,,,,,,,,,,,,,,application/pdf,,,English,Essays,Carlton_ConfederatesCollegium_2000,"Carlton, Patrick W. ""Confederates in the Collegium: The Influence of J.E.B. Stuart's Leadership on the Development of Virginia Tech,"" 125th Anniversary exhibit, Special Collections and University Archives, Virginia Tech, Blacksburg, Va.",,,,,,,,,,,,"Contact Special Collections for more information.",,,,,,,,,,,,,,,,,,,,,,,,,,,,,,,,,,,,,,,,,,,,,,,,,,,,,,,,,,,,,,,,,,,,,,,"https://digitalsc.lib.vt.edu/files/original/11b1b416ddb5a665c9bb9db890c920b6.pdf,https://digitalsc.lib.vt.edu/files/original/bc16ef18994e408abe01a72dc5c56f19.jpg",Document,"125th Anniversary of Virginia Tech Collection",1,0
13120,https://digitalsc.lib.vt.edu/items/show/13120,"""Four Women on Boards of Leading Virginia Colleges: Two Will Serve at University of Virginia and Two at Virginia Tech,"" by Virginia Waller Davis.",,"University Archives^^University History^^Virginia Agricultural and Mechanical College^^Virginia Agricultural and Mechanical College and Polytechnic Institute^^Virginia Polytechnic Institute^^Virginia Polytechnic Institute and State University","Newspaper article, ""Four Women on Boards of Leading Virginia Colleges: Two Will Serve at University of Virginia and Two at Virginia Tech,"" by Virginia Waller Davis, Roanoke Times, August 16, 1944. This pdf document was created from an existing webpage from the original 125th Anniversary digital exhibit. ",,,"Davis, Virginia Waller","Roanoke Times",,1944-08-16,,,,,,,,,,"This item is protected by copyright and/or related rights. You are free to use this Item in any way that is permitted by the copyright and related rights legislation that applies to your use. In addition, no permission is required from the rights-holder(s) for educational uses. For other uses, you need to obtain permission from the rights-holder(s). <a href=""https://rightsstatements.org/page/InC-EDU/1.0/?language=en"" target=""_blank"" rel=""noreferrer noopener"">https://rightsstatements.org/page/InC-EDU/1.0/?language=en</a>",,,,,,,,,"Board of Visitors Collection, 125th Anniversary of Virginia Tech Collection",,,,,,,,application/pdf,,,English,,bov_Davis_FourWomen_1944,"Davis, Virginia Waller. ""Four Women on Boards of Leading Virginia Colleges: Two Will Serve at University of Virginia and Two at Virginia Tech,"" Roanoke Times, August 16, 1944.",,,,,,,,,,,,"Roanoke Times",,,,,,,,,,,,,,,,,,,,,,,,,,,,,,,,,,,,PDF,,,,,,,,,,,,,,,,,,,,,,,,,,,,,,,,,,,https://digitalsc.lib.vt.edu/files/original/eca716522c20794e503eaf6121c8e98e.pdf,Document,"Board of Visitors Collection, 125th Anniversary of Virginia Tech Collection",1,0
12728,https://digitalsc.lib.vt.edu/items/show/12728,"""We Remember,"" by Steveson W. Fletcher and Margaret R. Fletcher, a memoir",,"Solitude (Blacksburg, Va.: Historic building)^^Blacksburg (Va.)^^Montgomery County (Va.)^^Local/Regional History and Appalachian South^^Virginia Polytechnic Institute and State University^^University History","Memoir by Stevenson W. and Margaret R. Fletcher about their lives from 1908-1914, including living at Solitude, the birth of several of their children, vacations, and purchasing/owning a farm in Augusta County. ",,,"Fletcher, Stevenson W.^^Fletcher, Margaret R.^^Fletcher, Stevenson W., Jr.","Fletcher Family Digital Collection on Solitude",,12/1/1951,,,,,,,,,,"Special Collections and University Archives does not hold these original materials. Digital reproductions were provided for exhibit purposes only. This Item is protected by copyright and/or related rights. You are free to use this Item in any way that is permitted by the copyright and related rights legislation that applies to your use. In addition, no permission is required from the rights-holder(s) for educational uses. For other uses, you need to obtain permission from the rights-holder(s). <a href=""https://rightsstatements.org/page/InC-EDU/1.0/?language=en"" target=""_blank"" rel=""noreferrer noopener"">https://rightsstatements.org/page/InC-EDU/1.0/?language=en</a>",,,,,,,,,"Fletcher Family Digital Collection on Solitude",,,,,,,,application/pdf,,,English,Memoirs,Fletcher_SFletcher_Memoir,"[item], Fletcher Family Digital Collection on Solitude, Special Collections and University Archives, Virginia Tech, Blacksburg, Va.",,,,,,,,,,,,"Contact Special Collections and University Archives, Virginia Tech, for more information.",,,,,,,,,,,,,,,,,,,,,,,,,,,,,,,,,,,,PDF,,,,,,,,,,,,,,,,,,,,,,,,,,,,,,,,,,,https://digitalsc.lib.vt.edu/files/original/00e500cd35798b09870ea2e82be217bf.pdf,Document,"Fletcher Family Digital Collection on Solitude",1,0
13121,https://digitalsc.lib.vt.edu/items/show/13121,"""Women on College Board Full-Fledged Members: Attend First Meeting with Group Consistently Male for 72 years"" by Virginia Waller Davis",,"University Archives^^University History^^Virginia Agricultural and Mechanical College^^Virginia Agricultural and Mechanical College and Polytechnic Institute^^Virginia Polytechnic Institute^^Virginia Polytechnic Institute and State University","Newspaper article, ""Women on College Board Full-Fledged Members: Attend First Meeting with Group Consistently Male for 72 years,"" by Virginia Waller Davis, Roanoke Times, August 15, 1944. This pdf document was created from an existing webpage from the original 125th Anniversary digital exhibit. ",,,"Davis, Virginia Waller","Roanoke Times",,1944-08-15,,,,,,,,,,"This item is protected by copyright and/or related rights. You are free to use this Item in any way that is permitted by the copyright and related rights legislation that applies to your use. In addition, no permission is required from the rights-holder(s) for educational uses. For other uses, you need to obtain permission from the rights-holder(s). <a href=""https://rightsstatements.org/page/InC-EDU/1.0/?language=en"" target=""_blank"" rel=""noreferrer noopener"">https://rightsstatements.org/page/InC-EDU/1.0/?language=en</a>",,,,,,,,,"Board of Visitors Collection, 125th Anniversary of Virginia Tech Collection",,,,,,,,application/pdf,,,English,,bov_Davis_WomenOnBoard_1944,"Davis, Virginia Waller. ""Women on College Board Full-Fledged Members: Attend First Meeting with Group Consistently Male for 72 years,"" Roanoke Times, August 15, 1944. ",,,,,,,,,,,,"Roanoke Times",,,,,,,,,,,,,,,,,,,,,,,,,,,,,,,,,,,,PDF,,,,,,,,,,,,,,,,,,,,,,,,,,,,,,,,,,,https://digitalsc.lib.vt.edu/files/original/70fe1f8c5126977461741fd55df6303f.pdf,Document,"Board of Visitors Collection, 125th Anniversary of Virginia Tech Collection",1,0
13928,https://digitalsc.lib.vt.edu/items/show/13928,"<em>Extract of the Biennial Report</em> for the State of Virginia (Ms1988-009)",,"Blacksburg (Va.)^^Local/Regional History and Appalachian South^^African American history^^Montgomery County (Va.)","<em>Extract of the Biennial Report of A.T. Shirley District Grand Secretary of District Grand Lodge</em> including financial reports.",,,"Grand United Order of Odd Fellows in America, Tadmore Light Lodge #6196","<a href=""http://ead.lib.virginia.edu/vivaead/published/vt/viblbv00006.xml.frame"" target=""_blank"">See the Finding Aid for the Blacksburg Virginia Odd Fellows Records</a>",,1921-08-23,,,,,,,,,,"This Item is protected by copyright and/or related rights. You are free to use this Item in any way that is permitted by the copyright and related rights legislation that applies to your use. In addition, no permission is required from the rights-holder(s) for educational uses. For other uses, you need to obtain permission from the rights-holder(s). <a href=""https://rightsstatements.org/page/InC-EDU/1.0/?language=en"" target=""_blank"">https://rightsstatements.org/page/InC-EDU/1.0/?language=en</a>",,,,,,,,,,,,,,,,,application/pdf,"10 pages",,Engish,"Administrative records",Ms1988_009_B01_F31_001,"Blacksburg [Virginia] Odd Fellows Records, 1902-1969, Ms1988-009, Special Collections, University Libraries, Virginia Polytechnic Institute and State University.",,,,,,,,,,,,"<a href=""http://spec.lib.vt.edu/"" target=""_blank"">Special Collections and University Archives, University Libraries, Virginia Tech</a>",,,,,,,,,,,,,,,,,,,,,,,,,,,,,,,,,,,,PDF,,,,,,,,,,,,,,,,,,,,,,,,,,,,,,,,,,,https://digitalsc.lib.vt.edu/files/original/413e7f44d69cb03ebeae40fd99978d84.pdf,Document,"Blacksburg [Virginia] Odd Fellows Records, 1902-1969 (Ms1988-009)",1,0
13906,https://digitalsc.lib.vt.edu/items/show/13906,"<em>Funeral Ceremony for the Use of the Grand United Order of Odd Fellows in America</em> (Ms1988-009)",,"Blacksburg (Va.)^^Local/Regional History and Appalachian South^^African American history^^Montgomery County (Va.)","Book describing funeral ceremony for the Grand United Order of Odd Fellows",,,"Grand United Order of Odd Fellows in America, Tadmore Light Lodge #6186","<a href=""http://ead.lib.virginia.edu/vivaead/published/vt/viblbv00006.xml.frame"" target=""_blank"">See the Finding Aid for the Blacksburg Virginia Odd Fellows Records</a>",,1902,,,,,,,,,,"This Item is protected by copyright and/or related rights. You are free to use this Item in any way that is permitted by the copyright and related rights legislation that applies to your use. In addition, no permission is required from the rights-holder(s) for educational uses. For other uses, you need to obtain permission from the rights-holder(s). <a href=""https://rightsstatements.org/page/InC-EDU/1.0/?language=en"" target=""_blank"">https://rightsstatements.org/page/InC-EDU/1.0/?language=en</a>",,,,,,,,,,,,,,,,,application/pdf,"12 pages",,English,Books,Ms1988_009_B01_F01_001,"Blacksburg [Virginia] Odd Fellows Records, 1902-1969, Ms1988-009, Special Collections, University Libraries, Virginia Polytechnic Institute and State University.",,,,,,,,,,,,"<a href=""http://spec.lib.vt.edu/"" target=""_blank"">Special Collections and University Archives, University Libraries, Virginia Tech</a>",,,,,,,,,,,,,,,,,,,,,,,,,,,,,,,,,,,,PDF,,,,,,,,,,,,,,,,,,,,,,,,,,,,,,,,,,,https://digitalsc.lib.vt.edu/files/original/3d005ffd1db0d0242cf1dfd07252923a.pdf,Document,"Blacksburg [Virginia] Odd Fellows Records, 1902-1969 (Ms1988-009)",1,0
4148,https://digitalsc.lib.vt.edu/items/show/4148,"<em>Odd Fellows Journal</em>, May 7, 1936 (Ms1988-009)",,"Blacksburg (Va.)^^Local/Regional History and Appalachian South^^African American history^^Montgomery County (Va.)","Excerpt from the national <em>Odd Fellow's Journal</em>",,,"Grand United Order of Odd Fellows in America, Tadmore Light Lodge #6184","<a href=""http://ead.lib.virginia.edu/vivaead/published/vt/viblbv00006.xml.frame"" target=""_blank"">See the Finding Aid for the Blacksburg Virginia Odd Fellows Records</a>",,1936-05-07,,,,,,,,,,"This Item is protected by copyright and/or related rights. You are free to use this Item in any way that is permitted by the copyright and related rights legislation that applies to your use. In addition, no permission is required from the rights-holder(s) for educational uses. For other uses, you need to obtain permission from the rights-holder(s). <a href=""https://rightsstatements.org/page/InC-EDU/1.0/?language=en"" target=""_blank"">https://rightsstatements.org/page/InC-EDU/1.0/?language=en</a>",,,,,,,,,,,,,,,,,application/pdf,"1 page",,English,Newsletters,Ms1988_009_B01_F55,"Blacksburg [Virginia] Odd Fellows Records, 1902-1969, Ms1988-009, Special Collections, University Libraries, Virginia Polytechnic Institute and State University.",,,,,,,,,,,,"<a href=""http://spec.lib.vt.edu/"" target=""_blank"">Special Collections, University Libraries, Virginia Tech</a>",,,,,,,,,,,,,,,,,,,,,,,,,,,,,,,,,,,,,,,,,,,,,,,,,,,,,,,,,,,,,,,,,,,,,,,https://digitalsc.lib.vt.edu/files/original/4148/Ms1988-009_OddFellows_B1F55_Journal1.jpg,Document,"Blacksburg [Virginia] Odd Fellows Records, 1902-1969 (Ms1988-009)",1,0
13927,https://digitalsc.lib.vt.edu/items/show/13927,"<em>Ritual of the Grand Order of Odd Fellows, Book First.</em> (Ms1988-009)",,"Blacksburg (Va.)^^Local/Regional History and Appalachian South^^African American history^^Montgomery County (Va.)","Excerpts from the first ritual book of the Grand United Order of Odd Fellows, relating texts, hymns, passwords, and laws for lodges.",,,"Grand United Order of Odd Fellows in America, Tadmore Light Lodge #6195","<a href=""http://ead.lib.virginia.edu/vivaead/published/vt/viblbv00006.xml.frame"" target=""_blank"">See the Finding Aid for the Blacksburg Virginia Odd Fellows Records</a>",,1916,,,,,,,,,,"This Item is protected by copyright and/or related rights. You are free to use this Item in any way that is permitted by the copyright and related rights legislation that applies to your use. In addition, no permission is required from the rights-holder(s) for educational uses. For other uses, you need to obtain permission from the rights-holder(s). <a href=""https://rightsstatements.org/page/InC-EDU/1.0/?language=en"" target=""_blank"">https://rightsstatements.org/page/InC-EDU/1.0/?language=en</a>",,,,,,,,,,,,,,,,,application/pdf,"62 pages",,English,Books,Ms1988_009_B01_F24_001,"Blacksburg [Virginia] Odd Fellows Records, 1902-1969, Ms1988-009, Special Collections, University Libraries, Virginia Polytechnic Institute and State University.",,,,,,,,,,,,"<a href=""http://spec.lib.vt.edu/"" target=""_blank"">Special Collections and University Archives, University Libraries, Virginia Tech</a>",,,,,,,,,,,,,,,,,,,,,,,,,,,,,,,,,,,,PDF,,,,,,,,,,,,,,,,,,,,,,,,,,,,,,,,,,,https://digitalsc.lib.vt.edu/files/original/e81699271a76df027ca6223e8d50eaf7.pdf,Document,"Blacksburg [Virginia] Odd Fellows Records, 1902-1969 (Ms1988-009)",1,0
13004,https://digitalsc.lib.vt.edu/items/show/13004,"<em>The Tin Horn</em>, 1929",,"University Archives^^University History^^Virginia Polytechnic Institute^^Women^^Women in higher education","The second volume of the Tin Horn, the yearbook for and by the female students at Virginia Polytechnic Institute. 
