﻿"Dublin Core:Title","Dublin Core:Alternative Title","Dublin Core:Subject","Dublin Core:Description","Dublin Core:Abstract","Dublin Core:Table Of Contents","Dublin Core:Creator","Dublin Core:Source","Dublin Core:Publisher","Dublin Core:Date","Dublin Core:Date Available","Dublin Core:Date Created","Dublin Core:Date Accepted","Dublin Core:Date Copyrighted","Dublin Core:Date Submitted","Dublin Core:Date Issued","Dublin Core:Date Modified","Dublin Core:Date Valid","Dublin Core:Contributor","Dublin Core:Rights","Dublin Core:Access Rights","Dublin Core:License","Dublin Core:Relation","Dublin Core:Conforms To","Dublin Core:Has Format","Dublin Core:Has Part","Dublin Core:Has Version","Dublin Core:Is Format Of","Dublin Core:Is Part Of","Dublin Core:Is Referenced By","Dublin Core:Is Replaced By","Dublin Core:Is Required By","Dublin Core:Is Version Of","Dublin Core:References","Dublin Core:Replaces","Dublin Core:Requires","Dublin Core:Format","Dublin Core:Extent","Dublin Core:Medium","Dublin Core:Language","Dublin Core:Type","Dublin Core:Identifier","Dublin Core:Bibliographic Citation","Dublin Core:Coverage","Dublin Core:Spatial Coverage","Dublin Core:Temporal Coverage","Dublin Core:Accrual Method","Dublin Core:Accrual Periodicity","Dublin Core:Accrual Policy","Dublin Core:Audience","Dublin Core:Audience Education Level","Dublin Core:Mediator","Dublin Core:Instructional Method","Dublin Core:Provenance","Dublin Core:Rights Holder","Item Type Metadata:Text","Item Type Metadata:Interviewer","Item Type Metadata:Interviewee","Item Type Metadata:Location","Item Type Metadata:Transcription","Item Type Metadata:Local URL","Item Type Metadata:Original Format","Item Type Metadata:Physical Dimensions","Item Type Metadata:Duration","Item Type Metadata:Compression","Item Type Metadata:Producer","Item Type Metadata:Director","Item Type Metadata:Bit Rate/Frequency","Item Type Metadata:Time Summary","Item Type Metadata:Email Body","Item Type Metadata:Subject Line","Item Type Metadata:From","Item Type Metadata:To","Item Type Metadata:CC","Item Type Metadata:BCC","Item Type Metadata:Number of Attachments","Item Type Metadata:Standards","Item Type Metadata:Objectives","Item Type Metadata:Materials","Item Type Metadata:Lesson Plan Text","Item Type Metadata:URL","Item Type Metadata:Event Type","Item Type Metadata:Participants","Item Type Metadata:Birth Date","Item Type Metadata:Birthplace","Item Type Metadata:Death Date","Item Type Metadata:Occupation","Item Type Metadata:Biographical Text","Item Type Metadata:Bibliography","Item Type Metadata:Transcript","Item Type Metadata:Viewer","Item Type Metadata:Narrator","Item Type Metadata:Production Team","Item Type Metadata:Display Resolution","Item Type Metadata:Frame Rate","Item Type Metadata:Player","Omeka Legacy File:Additional Creator","Omeka Legacy File:Transcriber","Omeka Legacy File:Producer","Omeka Legacy File:Render Device","Omeka Legacy File:Render Details","Omeka Legacy File:Capture Date","Omeka Legacy File:Capture Device","Omeka Legacy File:Capture Details","Omeka Legacy File:Change History","Omeka Legacy File:Watermark","Omeka Legacy File:Encryption","Omeka Legacy File:Compression","Omeka Legacy File:Post Processing","Omeka Image File:Width","Omeka Image File:Height","Omeka Image File:Bit Depth","Omeka Image File:Channels","Omeka Image File:Exif String","Omeka Image File:Exif Array","Omeka Image File:IPTC String","Omeka Image File:IPTC Array","Omeka Video File:Bitrate","Omeka Video File:Duration","Omeka Video File:Sample Rate","Omeka Video File:Codec","Omeka Video File:Width","Omeka Video File:Height","PDF Text:Text",Scripto:Transcription,tags,file,itemType,collection,public,featured
"Letter from Mayor of Chicago",,,,,,"Mayor of Chicago",,"Digital Library and Archives, University Libraries, Virginia Tech",,,6/13/2007,,,,,,,"Paul Rossi","Unless otherwise noted, Virginia Tech owns the materials in the Virginia Tech April 16, 2007, Archives of the University Libraries, and retains copyright for the physical and digital materials that comprise the Archives. For further information see http://scholar.lib.vt.edu/prevail/copyright416.html","Unless otherwise noted this resource is available to the public.",,,,,,,,,,,,,,,,,,,,Document,S5L28C1618,,,Chicago,,,,,,,,,,,,,,,,,,,,,,,,,,,,,,,,,,,,,,,,,,,,,,,,,,,,,,,,,,,,,,,,,,,,,,,,,,,,,,,,,,http://spec.lib.vt.edu/pickup/Omeka_upload/S5L28C1618.jpg,,"Virginia Tech April 16, 2007 Archives of the University Libraries (MS2008-020)",1,0
"Card from City Council of Simi Valley",,,,,,"Simi Valley (Calif.). City Council",,"Digital Library and Archives, University Libraries, Virginia Tech",,,6/15/2007,,,,,,,"Paul Rossi","Unless otherwise noted, Virginia Tech owns the materials in the Virginia Tech April 16, 2007, Archives of the University Libraries, and retains copyright for the physical and digital materials that comprise the Archives. For further information see http://scholar.lib.vt.edu/prevail/copyright416.html","Unless otherwise noted this resource is available to the public.",,,,,,,,,,,,,,,,,,,,Document,S5L28C1617,,,"Simi Valley",,,,,,,,,,,,,,,,,,,,,,,,,,,,,,,,,,,,,,,,,,,,,,,,,,,,,,,,,,,,,,,,,,,,,,,,,,,,,,,,,,http://spec.lib.vt.edu/pickup/Omeka_upload/S5L28C1617.jpg,,"Virginia Tech April 16, 2007 Archives of the University Libraries (MS2008-020)",1,0
"Letter sent to United States Ambassador to Latvia",,,,,,,,"Digital Library and Archives, University Libraries, Virginia Tech",,,"c. 2007",,,,,,,"Paul Rossi","Unless otherwise noted, Virginia Tech owns the materials in the Virginia Tech April 16, 2007, Archives of the University Libraries, and retains copyright for the physical and digital materials that comprise the Archives. For further information see http://scholar.lib.vt.edu/prevail/copyright416.html","Unless otherwise noted this resource is available to the public.",,,,,,,,,,,,,,,,,,,,Document,S5L28C1608,,,Latvia,,,,,,,,,,,,,,,,,,,,,,,,,,,,,,,,,,,,,,,,,,,,,,,,,,,,,,,,,,,,,,,,,,,,,,,,,,,,,,,,,,http://spec.lib.vt.edu/pickup/Omeka_upload/S5L28C1608.jpg,,"Virginia Tech April 16, 2007 Archives of the University Libraries (MS2008-020)",1,0
"Card from Cast and Crew of Legally Blonde on Broadway",,,,,,"Palace Theatre. Legally Blonde Cast and Crew",,"Digital Library and Archives, University Libraries, Virginia Tech",,,"c. 2007",,,,,,,"Paul Rossi","Unless otherwise noted, Virginia Tech owns the materials in the Virginia Tech April 16, 2007, Archives of the University Libraries, and retains copyright for the physical and digital materials that comprise the Archives. For further information see http://scholar.lib.vt.edu/prevail/copyright416.html","Unless otherwise noted this resource is available to the public.",,,,,,,,,,,,,,,,,,,,Document,S5L28C1602,,,"New York",,,,,,,,,,,,,,,,,,,,,,,,,,,,,,,,,,,,,,,,,,,,,,,,,,,,,,,,,,,,,,,,,,,,,,,,,,,,,,,,,,http://spec.lib.vt.edu/pickup/Omeka_upload/S5L28C1602.jpg,,"Virginia Tech April 16, 2007 Archives of the University Libraries (MS2008-020)",1,0
"Poster of the 1000 paper cranes project for Virginia Tech by the Japanese Student Association",,Memorials,,,,"Japanese Student Association",,"Digital Library and Archives, University Libraries, Virginia Tech",,,"c. 2007",,,,,,,"Paul Rossi","Unless otherwise noted, Virginia Tech owns the materials in the Virginia Tech April 16, 2007, Archives of the University Libraries, and retains copyright for the physical and digital materials that comprise the Archives. For further information see http://scholar.lib.vt.edu/prevail/copyright416.html","Unless otherwise noted this resource is available to the public.",,,,,,,,,,,,,,,,,,,,Document,S5L27H0212,,,Denver,,,,,,,,,,,,,,,,,,,,,,,,,,,,,,,,,,,,,,,,,,,,,,,,,,,,,,,,,,,,,,,,,,,,,,,,,,,,,,,,,,http://spec.lib.vt.edu/pickup/Omeka_upload/S5L27H0212.jpg,,"Virginia Tech April 16, 2007 Archives of the University Libraries (MS2008-020)",1,0
"Photograph of Big Sandy Community and Technical College faculty and staff in VT formation",,"Portraits, Group",,,,"Big Sandy Community and Technical College",,"Digital Library and Archives, University Libraries, Virginia Tech",,,7/5/2007,,,,,,,"Vincent Kline","Unless otherwise noted, Virginia Tech owns the materials in the Virginia Tech April 16, 2007, Archives of the University Libraries, and retains copyright for the physical and digital materials that comprise the Archives. For further information see http://scholar.lib.vt.edu/prevail/copyright416.html","Unless otherwise noted this resource is available to the public.",,,,,,,,,,,,,,,,,,,,"Still Image",S5L26F0042,,,Prestonburg,,,,,,,,,,,,,,,,,,,,,,,,,,,,,,,,,,,,,,,,,,,,,,,,,,,,,,,,,,,,,,,,,,,,,,,,,,,,,,,,,,http://spec.lib.vt.edu/pickup/Omeka_upload/S5L26F0042.jpg,,"Virginia Tech April 16, 2007 Archives of the University Libraries (MS2008-020)",1,0
"Photograph from Southeast Community College - Lincoln Campus Student Senate representatives planting a tree in memory of VT victims.",,"Portraits, Group",,,,"Southeast Community College. Lincoln Campus",,"Digital Library and Archives, University Libraries, Virginia Tech",,,5/9/2007,,,,,,,"Paul Rossi","Unless otherwise noted, Virginia Tech owns the materials in the Virginia Tech April 16, 2007, Archives of the University Libraries, and retains copyright for the physical and digital materials that comprise the Archives. For further information see http://scholar.lib.vt.edu/prevail/copyright416.html","Unless otherwise noted this resource is available to the public.",,,,,,,,,,,,,,,,,,,,"Still Image",S5L26F0029,,,Lincoln,,,,,,,,,,,,,,,,,,,,,,,,,,,,,,,,,,,,,,,,,,,,,,,,,,,,,,,,,,,,,,,,,,,,,,,,,,,,,,,,,,http://spec.lib.vt.edu/pickup/Omeka_upload/S5L26F0029.jpg,,"Virginia Tech April 16, 2007 Archives of the University Libraries (MS2008-020)",1,0
"Photograph fpf Geico employees clapping and holding up a signed vinyl banners at Virginia Beach",,"Portraits, Group",,,,"Geico Insurance",,"Digital Library and Archives, University Libraries, Virginia Tech",,,"c. 2007",,,,,,,"Paul Rossi","Unless otherwise noted, Virginia Tech owns the materials in the Virginia Tech April 16, 2007, Archives of the University Libraries, and retains copyright for the physical and digital materials that comprise the Archives. For further information see http://scholar.lib.vt.edu/prevail/copyright416.html","Unless otherwise noted this resource is available to the public.",,,,,,,,,,,,,,,,,,,,"Still Image",S5L26F0027,,,"Virginia Beach",,,,,,,,,,,,,,,,,,,,,,,,,,,,,,,,,,,,,,,,,,,,,,,,,,,,,,,,,,,,,,,,,,,,,,,,,,,,,,,,,,http://spec.lib.vt.edu/pickup/Omeka_upload/S5L26F0027.jpg,,"Virginia Tech April 16, 2007 Archives of the University Libraries (MS2008-020)",1,0
"Photograph on card showing a flag-raising to half-mast. From Ventura County Council of The Boy Scouts of America",,Photographs,,,,"Boy Scouts of America. Ventura County Council; Witman, Paul",,"Digital Library and Archives, University Libraries, Virginia Tech",,,4/21/2007,,,,,,,"Paul Rossi","Unless otherwise noted, Virginia Tech owns the materials in the Virginia Tech April 16, 2007, Archives of the University Libraries, and retains copyright for the physical and digital materials that comprise the Archives. For further information see http://scholar.lib.vt.edu/prevail/copyright416.html","Unless otherwise noted this resource is available to the public.",,,,,,,,,,,,,,,,,,,,"Still Image",S5L26F0023,,,"Thousand Oaks",,,,,,,,,,,,,,,,,,,,,,,,,,,,,,,,,,,,,,,,,,,,,,,,,,,,,,,,,,,,,,,,,,,,,,,,,,,,,,,,,,http://spec.lib.vt.edu/pickup/Omeka_upload/S5L26F0023.jpg,,"Virginia Tech April 16, 2007 Archives of the University Libraries (MS2008-020)",1,0
"Card with a photograph of Wor-Wic Community College students forming a VT sign",,"Portraits, Group",,,,"Wor-Wic Community College",,"Digital Library and Archives, University Libraries, Virginia Tech",,,4/23/2007,,,,,,,"Paul Rossi","Unless otherwise noted, Virginia Tech owns the materials in the Virginia Tech April 16, 2007, Archives of the University Libraries, and retains copyright for the physical and digital materials that comprise the Archives. For further information see http://scholar.lib.vt.edu/prevail/copyright416.html","Unless otherwise noted this resource is available to the public.",,,,,,,,,,,,,,,,,,,,"Still Image",S5L26F0016,,,Salisbury,,,,,,,,,,,,,,,,,,,,,,,,,,,,,,,,,,,,,,,,,,,,,,,,,,,,,,,,,,,,,,,,,,,,,,,,,,,,,,,,,,http://spec.lib.vt.edu/pickup/Omeka_upload/S5L26F0016.jpg,,"Virginia Tech April 16, 2007 Archives of the University Libraries (MS2008-020)",1,0
"Photograph from employees of Crucial Technology with placards stating ""We -Crucial- Care VT""",,"Portraits, Group",,,,"Crucial Technology",,"Digital Library and Archives, University Libraries, Virginia Tech",,,4/20/2007,,,,,,,"Paul Rossi","Unless otherwise noted, Virginia Tech owns the materials in the Virginia Tech April 16, 2007, Archives of the University Libraries, and retains copyright for the physical and digital materials that comprise the Archives. For further information see http://scholar.lib.vt.edu/prevail/copyright416.html","Unless otherwise noted this resource is available to the public.",,,,,,,,,,,,,,,,,,,,"Still Image",S5L26F0015,,,Meridian,,,,,,,,,,,,,,,,,,,,,,,,,,,,,,,,,,,,,,,,,,,,,,,,,,,,,,,,,,,,,,,,,,,,,,,,,,,,,,,,,,http://spec.lib.vt.edu/pickup/Omeka_upload/S5L26F0015.jpg,,"Virginia Tech April 16, 2007 Archives of the University Libraries (MS2008-020)",1,0
"Photograph of Southern States Cooperative employees wearing orange and maroon colors",,"Portraits, Group",,,,"Southern States Cooperative Incorporated",,"Digital Library and Archives, University Libraries, Virginia Tech",,,4/20/2007,,,,,,,"Paul Rossi","Unless otherwise noted, Virginia Tech owns the materials in the Virginia Tech April 16, 2007, Archives of the University Libraries, and retains copyright for the physical and digital materials that comprise the Archives. For further information see http://scholar.lib.vt.edu/prevail/copyright416.html","Unless otherwise noted this resource is available to the public.",,,,,,,,,,,,,,,,,,,,"Still Image",S5L26F0012,,,Richmond,,,,,,,,,,,,,,,,,,,,,,,,,,,,,,,,,,,,,,,,,,,,,,,,,,,,,,,,,,,,,,,,,,,,,,,,,,,,,,,,,,http://spec.lib.vt.edu/pickup/Omeka_upload/S5L26F0012.jpg,,"Virginia Tech April 16, 2007 Archives of the University Libraries (MS2008-020)",1,0
"Photograph of Western Connecticut State University students signing a banner to send to Virginia Tech",,"Portraits, Group",,,,"Western Connecticut State University",,"Digital Library and Archives, University Libraries, Virginia Tech",,,"c. 2007",,,,,,,"Paul Rossi","Unless otherwise noted, Virginia Tech owns the materials in the Virginia Tech April 16, 2007, Archives of the University Libraries, and retains copyright for the physical and digital materials that comprise the Archives. For further information see http://scholar.lib.vt.edu/prevail/copyright416.html","Unless otherwise noted this resource is available to the public.",,,,,,,,,,,,,,,,,,,,"Still Image",S5L26F0004,,,Danbury,,,,,,,,,,,,,,,,,,,,,,,,,,,,,,,,,,,,,,,,,,,,,,,,,,,,,,,,,,,,,,,,,,,,,,,,,,,,,,,,,,http://spec.lib.vt.edu/pickup/Omeka_upload/S5L26F0004.jpg,,"Virginia Tech April 16, 2007 Archives of the University Libraries (MS2008-020)",1,0
"Photograph of Frederick Douglass Elementary School 4th Grade Class students",,"Portraits, Group",,,,"Frederick Douglass Elementary School",,"Digital Library and Archives, University Libraries, Virginia Tech",,,"c. 2007",,,,,,,"Paul Rossi","Unless otherwise noted, Virginia Tech owns the materials in the Virginia Tech April 16, 2007, Archives of the University Libraries, and retains copyright for the physical and digital materials that comprise the Archives. For further information see http://scholar.lib.vt.edu/prevail/copyright416.html","Unless otherwise noted this resource is available to the public.",,,,,,,,,,,,,,,,,,,,"Still Image",S5L26F0002,,,Winchester,,,,,,,,,,,,,,,,,,,,,,,,,,,,,,,,,,,,,,,,,,,,,,,,,,,,,,,,,,,,,,,,,,,,,,,,,,,,,,,,,,http://spec.lib.vt.edu/pickup/Omeka_upload/S5L26F0002.jpg,,"Virginia Tech April 16, 2007 Archives of the University Libraries (MS2008-020)",1,0
"Photograph of Musselman Middle School students forming a large VT sign and a letter from Principal",,"Portraits, Group",,,,"Musselman Middle School",,"Digital Library and Archives, University Libraries, Virginia Tech",,,4/20/2007,,,,,,,"Paul Rossi","Unless otherwise noted, Virginia Tech owns the materials in the Virginia Tech April 16, 2007, Archives of the University Libraries, and retains copyright for the physical and digital materials that comprise the Archives. For further information see http://scholar.lib.vt.edu/prevail/copyright416.html","Unless otherwise noted this resource is available to the public.",,,,,,,,,,,,,,,,,,,,"Still Image",S5L26F0001,,,"Bunker Hill",,,,,,,,,,,,,,,,,,,,,,,,,,,,,,,,,,,,,,,,,,,,,,,,,,,,,,,,,,,,,,,,,,,,,,,,,,,,,,,,,,http://spec.lib.vt.edu/pickup/Omeka_upload/S5L26F0001.jpg,,"Virginia Tech April 16, 2007 Archives of the University Libraries (MS2008-020)",1,0
"Commemorative plaque for tree planted in Israel in memory of Liviu Librescu",,"Tree planting",,,,"Agudas Achim Sisterhood",,"Digital Library and Archives, University Libraries, Virginia Tech",,,"c. 2007",,,,,,,"Paul Rossi","Unless otherwise noted, Virginia Tech owns the materials in the Virginia Tech April 16, 2007, Archives of the University Libraries, and retains copyright for the physical and digital materials that comprise the Archives. For further information see http://scholar.lib.vt.edu/prevail/copyright416.html","Unless otherwise noted this resource is available to the public.",,,,,,,,,,,,,,,,,,,,Object,S5L25H0207,,,"Iowa City",,,,,,,,,,,,,,,,,,,,,,,,,,,,,,,,,,,,,,,,,,,,,,,,,,,,,,,,,,,,,,,,,,,,,,,,,,,,,,,,,,http://spec.lib.vt.edu/pickup/Omeka_upload/S5L25H0207.jpg,,"Virginia Tech April 16, 2007 Archives of the University Libraries (MS2008-020)",1,0
"Card from Sales Representatives of the Chesapeake Bay Region of GlaxoSmithKline",,,,,,"GlaxoSmithKline. Chesapeake Bay Region ; Weatherly, Sandra B (Regional Vice President)",,"Digital Library and Archives, University Libraries, Virginia Tech",,,5/25/2007,,,,,,,"Paul Rossi","Unless otherwise noted, Virginia Tech owns the materials in the Virginia Tech April 16, 2007, Archives of the University Libraries, and retains copyright for the physical and digital materials that comprise the Archives. For further information see http://scholar.lib.vt.edu/prevail/copyright416.html","Unless otherwise noted this resource is available to the public.",,,,,,,,,,,,,,,,,,,,Document,S5L25C2047,,,Philadelphia,,,,,,,,,,,,,,,,,,,,,,,,,,,,,,,,,,,,,,,,,,,,,,,,,,,,,,,,,,,,,,,,,,,,,,,,,,,,,,,,,,http://spec.lib.vt.edu/pickup/Omeka_upload/S5L25C2047.jpg,,"Virginia Tech April 16, 2007 Archives of the University Libraries (MS2008-020)",1,0
"Letter from Guardsman Group Limited",,,"Addressed to the United States Ambassador in Jamaica",,,"Guardsman Group Limited",,"Digital Library and Archives, University Libraries, Virginia Tech",,,4/19/2007,,,,,,,"Paul Rossi","Unless otherwise noted, Virginia Tech owns the materials in the Virginia Tech April 16, 2007, Archives of the University Libraries, and retains copyright for the physical and digital materials that comprise the Archives. For further information see http://scholar.lib.vt.edu/prevail/copyright416.html","Unless otherwise noted this resource is available to the public.",,,,,,,,,,,,,,,,,,,,Document,S5L24C2151,,,Kingston,,,,,,,,,,,,,,,,,,,,,,,,,,,,,,,,,,,,,,,,,,,,,,,,,,,,,,,,,,,,,,,,,,,,,,,,,,,,,,,,,,http://spec.lib.vt.edu/pickup/Omeka_upload/S5L24C2151.jpg,,"Virginia Tech April 16, 2007 Archives of the University Libraries (MS2008-020)",1,0
"Letter from Jamaica Teachers Association",,,"Addressed to the United States Ambassador in Jamaica",,,"Jamaica Teachers Association",,"Digital Library and Archives, University Libraries, Virginia Tech",,,4/23/2007,,,,,,,"Paul Rossi","Unless otherwise noted, Virginia Tech owns the materials in the Virginia Tech April 16, 2007, Archives of the University Libraries, and retains copyright for the physical and digital materials that comprise the Archives. For further information see http://scholar.lib.vt.edu/prevail/copyright416.html","Unless otherwise noted this resource is available to the public.",,,,,,,,,,,,,,,,,,,,Document,S5L24C2150,,,Kingston,,,,,,,,,,,,,,,,,,,,,,,,,,,,,,,,,,,,,,,,,,,,,,,,,,,,,,,,,,,,,,,,,,,,,,,,,,,,,,,,,,http://spec.lib.vt.edu/pickup/Omeka_upload/S5L24C2150.jpg,,"Virginia Tech April 16, 2007 Archives of the University Libraries (MS2008-020)",1,0
"Letter from Ambassador of Argentina",,,"Addressed to the United States Ambassador in Jamaica",,,"Argentina. Embassy (Jamaica)",,"Digital Library and Archives, University Libraries, Virginia Tech",,,4/17/2007,,,,,,,"Paul Rossi","Unless otherwise noted, Virginia Tech owns the materials in the Virginia Tech April 16, 2007, Archives of the University Libraries, and retains copyright for the physical and digital materials that comprise the Archives. For further information see http://scholar.lib.vt.edu/prevail/copyright416.html","Unless otherwise noted this resource is available to the public.",,,,,,,,,,,,,,,,,,,,Document,S5L24C2149,,,Kingston,,,,,,,,,,,,,,,,,,,,,,,,,,,,,,,,,,,,,,,,,,,,,,,,,,,,,,,,,,,,,,,,,,,,,,,,,,,,,,,,,,http://spec.lib.vt.edu/pickup/Omeka_upload/S5L24C2149.jpg,,"Virginia Tech April 16, 2007 Archives of the University Libraries (MS2008-020)",1,0
"Letter from National Executive Council of the People's National Party of Jamaica",,,"Sent to the United States Embassy in Jamaica",,,"People's National Party of Jamaica",,"Digital Library and Archives, University Libraries, Virginia Tech",,,4/23/2007,,,,,,,"Paul Rossi","Unless otherwise noted, Virginia Tech owns the materials in the Virginia Tech April 16, 2007, Archives of the University Libraries, and retains copyright for the physical and digital materials that comprise the Archives. For further information see http://scholar.lib.vt.edu/prevail/copyright416.html","Unless otherwise noted this resource is available to the public.",,,,,,,,,,,,,,,,,,,,Document,S5L24C2148,,,Kingston,,,,,,,,,,,,,,,,,,,,,,,,,,,,,,,,,,,,,,,,,,,,,,,,,,,,,,,,,,,,,,,,,,,,,,,,,,,,,,,,,,http://spec.lib.vt.edu/pickup/Omeka_upload/S5L24C2148.jpg,,"Virginia Tech April 16, 2007 Archives of the University Libraries (MS2008-020)",1,0
"Oversized card from Hamilton Elementary",,"Portraits, Group",,,,"Hamilton Elementary School",,"Digital Library and Archives, University Libraries, Virginia Tech",,,"c. 2007",,,,,,,"Paul Rossi","Unless otherwise noted, Virginia Tech owns the materials in the Virginia Tech April 16, 2007, Archives of the University Libraries, and retains copyright for the physical and digital materials that comprise the Archives. For further information see http://scholar.lib.vt.edu/prevail/copyright416.html","Unless otherwise noted this resource is available to the public.",,,,,,,,,,,,,,,,,,,,Document,S5L23C2302,,,Hamilton,,,,,,,,,,,,,,,,,,,,,,,,,,,,,,,,,,,,,,,,,,,,,,,,,,,,,,,,,,,,,,,,,,,,,,,,,,,,,,,,,,http://spec.lib.vt.edu/pickup/Omeka_upload/S5L23C2302.jpg,,"Virginia Tech April 16, 2007 Archives of the University Libraries (MS2008-020)",1,0
"Printed pictures and card from Volvo Trucks of North America",,,,,,"Volvo Trucks of North America",,"Digital Library and Archives, University Libraries, Virginia Tech",,,"c. 2007",,,,,,,"Paul Rossi","Unless otherwise noted, Virginia Tech owns the materials in the Virginia Tech April 16, 2007, Archives of the University Libraries, and retains copyright for the physical and digital materials that comprise the Archives. For further information see http://scholar.lib.vt.edu/prevail/copyright416.html","Unless otherwise noted this resource is available to the public.",,,,,,,,,,,,,,,,,,,,Document,S5L23C2298,,,Dublin,,,,,,,,,,,,,,,,,,,,,,,,,,,,,,,,,,,,,,,,,,,,,,,,,,,,,,,,,,,,,,,,,,,,,,,,,,,,,,,,,,http://spec.lib.vt.edu/pickup/Omeka_upload/S5L23C2298.jpg,,"Virginia Tech April 16, 2007 Archives of the University Libraries (MS2008-020)",1,0