﻿"Dublin Core:Title","Dublin Core:Alternative Title","Dublin Core:Subject","Dublin Core:Description","Dublin Core:Abstract","Dublin Core:Table Of Contents","Dublin Core:Creator","Dublin Core:Source","Dublin Core:Publisher","Dublin Core:Date","Dublin Core:Date Available","Dublin Core:Date Created","Dublin Core:Date Accepted","Dublin Core:Date Copyrighted","Dublin Core:Date Submitted","Dublin Core:Date Issued","Dublin Core:Date Modified","Dublin Core:Date Valid","Dublin Core:Contributor","Dublin Core:Rights","Dublin Core:Access Rights","Dublin Core:License","Dublin Core:Relation","Dublin Core:Conforms To","Dublin Core:Has Format","Dublin Core:Has Part","Dublin Core:Has Version","Dublin Core:Is Format Of","Dublin Core:Is Part Of","Dublin Core:Is Referenced By","Dublin Core:Is Replaced By","Dublin Core:Is Required By","Dublin Core:Is Version Of","Dublin Core:References","Dublin Core:Replaces","Dublin Core:Requires","Dublin Core:Format","Dublin Core:Extent","Dublin Core:Medium","Dublin Core:Language","Dublin Core:Type","Dublin Core:Identifier","Dublin Core:Bibliographic Citation","Dublin Core:Coverage","Dublin Core:Spatial Coverage","Dublin Core:Temporal Coverage","Dublin Core:Accrual Method","Dublin Core:Accrual Periodicity","Dublin Core:Accrual Policy","Dublin Core:Audience","Dublin Core:Audience Education Level","Dublin Core:Mediator","Dublin Core:Instructional Method","Dublin Core:Provenance","Dublin Core:Rights Holder","Item Type Metadata:Text","Item Type Metadata:Interviewer","Item Type Metadata:Interviewee","Item Type Metadata:Location","Item Type Metadata:Transcription","Item Type Metadata:Local URL","Item Type Metadata:Original Format","Item Type Metadata:Physical Dimensions","Item Type Metadata:Duration","Item Type Metadata:Compression","Item Type Metadata:Producer","Item Type Metadata:Director","Item Type Metadata:Bit Rate/Frequency","Item Type Metadata:Time Summary","Item Type Metadata:Email Body","Item Type Metadata:Subject Line","Item Type Metadata:From","Item Type Metadata:To","Item Type Metadata:CC","Item Type Metadata:BCC","Item Type Metadata:Number of Attachments","Item Type Metadata:Standards","Item Type Metadata:Objectives","Item Type Metadata:Materials","Item Type Metadata:Lesson Plan Text","Item Type Metadata:URL","Item Type Metadata:Event Type","Item Type Metadata:Participants","Item Type Metadata:Birth Date","Item Type Metadata:Birthplace","Item Type Metadata:Death Date","Item Type Metadata:Occupation","Item Type Metadata:Biographical Text","Item Type Metadata:Bibliography","Item Type Metadata:Transcript","Item Type Metadata:Viewer","Item Type Metadata:Narrator","Item Type Metadata:Production Team","Item Type Metadata:Display Resolution","Item Type Metadata:Frame Rate","Item Type Metadata:Player","Omeka Legacy File:Additional Creator","Omeka Legacy File:Transcriber","Omeka Legacy File:Producer","Omeka Legacy File:Render Device","Omeka Legacy File:Render Details","Omeka Legacy File:Capture Date","Omeka Legacy File:Capture Device","Omeka Legacy File:Capture Details","Omeka Legacy File:Change History","Omeka Legacy File:Watermark","Omeka Legacy File:Encryption","Omeka Legacy File:Compression","Omeka Legacy File:Post Processing","Omeka Image File:Width","Omeka Image File:Height","Omeka Image File:Bit Depth","Omeka Image File:Channels","Omeka Image File:Exif String","Omeka Image File:Exif Array","Omeka Image File:IPTC String","Omeka Image File:IPTC Array","Omeka Video File:Bitrate","Omeka Video File:Duration","Omeka Video File:Sample Rate","Omeka Video File:Codec","Omeka Video File:Width","Omeka Video File:Height","PDF Text:Text",Scripto:Transcription,tags,file,itemType,collection,public,featured
"Victim's Father Stresses Compassion for Patients",,"Sexual minorities",,,,,,"The Collegiate Times",1986-02-29,,,,,,,,,,,,,,,,,,,,,,,,,,,,,,,Articles,CT_Vol82_No36_1986_0229b,,,,,,,,,,,,,,,,,,,,,,,,,,,,,,,,,,,,,,,,,,,,,,,,,PDF,,,,,,,,,,,,,,,,,,,,,,,,,,,,,,,,,,,,https://digitalsc.lib.vt.edu/files/original/3671/CT_Vol82_No36_1986_0229b.pdf,Document,"Collegiate Times LGBTQ Articles",1,0
"Two-day AIDS Meeting Begins Today",,"Sexual minorities",,,,,,"The Collegiate Times",1991-03-22,,,,,,,,,,,,,,,,,,,,,,,,,,,,,,,Articles,CT_Vol87_No49_1991_0322_pgA3,,,,,,,,,,,,,,,,,,,,,,,,,,,,,,,,,,,,,,,,,,,,,,,,,PDF,,,,,,,,,,,,,,,,,,,,,,,,,,,,,,,,,,,,https://digitalsc.lib.vt.edu/files/original/3612/CT_Vol87_No49_1991_0322_pgA3.pdf,Document,"Collegiate Times LGBTQ Articles",1,0
"Two Letters to the editor, Ignorance Dispelled by Reason & Accepting Lifestyles, responses to 'Committing What is Shameful' letter on October 23, 1990",,"Sexual minorities",,,,,,"The Collegiate Times",1990-10-26,,,,,,,,,,,,,,,,,,,,,,,,,,,,,,,Articles,CT_Vol87_No18_1990_1026_pgA5,,,,,,,,,,,,,,,,,,,,,,,,,,,,,,,,,,,,,,,,,,,,,,,,,PDF,,,,,,,,,,,,,,,,,,,,,,,,,,,,,,,,,,,,https://digitalsc.lib.vt.edu/files/original/3624/CT_Vol87_No18_1990_1026_pgA5.pdf,Document,"Collegiate Times LGBTQ Articles",1,0
"Three new cultural centers strive to foster inclusivity","Squires' new Hispanic Latino, LGBTQ+, and American Indian and Indigenous Cultural Centers aim to foster inclusive initiatives and discussion.","LGBTQ+ History",,,,,,"The Collegiate Times",2016-09-15,,,,,,,,,,,,,,,,,,,,,,,,,,,,,,,Articles,CT_2016_09_15_p3,,,,,,,,,,,,,,,,,,,,,,,,,,,,,,,,,,,,,,,,,,,,,,,,,PDF,,,,,,,,,,,,,,,,,,,,,,,,,,,,,,,,,,,,https://digitalsc.lib.vt.edu/files/original/9323ed3eed3efc7dda2e8191a0c0ad04.pdf,Document,"Collegiate Times LGBTQ Articles",1,0
"The Bible is Specific About Homosexuality",,"Sexual minorities",,,,,,"The Collegiate Times",1979-04-17,,,,,,,,,,,,,,,,,,,,,,,,,,,,,,,Articles,CT_Vol75_No44_1979_0417_pg5,,,,,,,,,,,,,,,,,,,,,,,,,,,,,,,,,,,,,,,,,,,,,,,,,PDF,,,,,,,,,,,,,,,,,,,,,,,,,,,,,,,,,,,,https://digitalsc.lib.vt.edu/files/original/3705/CT_Vol75_No44_1979_0417_pg5.pdf,Document,"Collegiate Times LGBTQ Articles",1,0
"Tech's Gay Community Politically Unsuccessful",,"Sexual minorities",,,,"Edwards, Gregory Allen",,"The Collegiate Times",1985-02-05,,,,,,,,,,,,,,,,,,,,,,,,,,,,,,,Articles,CT_Vol81_No31_1985_0205,,,,,,,,,,,,,,,,,,,,,,,,,,,,,,,,,,,,,,,,,,,,,,,,,PDF,,,,,,,,,,,,,,,,,,,,,,,,,,,,,,,,,,,,https://digitalsc.lib.vt.edu/files/original/3688/CT_Vol81_No31_1985_0205.pdf,Document,"Collegiate Times LGBTQ Articles",1,0
"Tech's AIDS Policy Individual-specific",,"Sexual minorities",,,,,,"The Collegiate Times",1988-04-26,,,,,,,,,,,,,,,,,,,,,,,,,,,,,,,Articles,CT_Vol84_No54_1988_0426,,,,,,,,,,,,,,,,,,,,,,,,,,,,,,,,,,,,,,,,,,,,,,,,,PDF,,,,,,,,,,,,,,,,,,,,,,,,,,,,,,,,,,,,https://digitalsc.lib.vt.edu/files/original/3660/CT_Vol84_No54_1988_0426.pdf,Document,"Collegiate Times LGBTQ Articles",1,0
"Tech to Host Two-day Symposium on AIDS Crisis",,"Sexual minorities",,,,,,"The Collegiate Times",1991-03-01,,,,,,,,,,,,,,,,,,,,,,,,,,,,,,,Articles,CT_Vol87_No45_1991_0301_pgA2,,,,,,,,,,,,,,,,,,,,,,,,,,,,,,,,,,,,,,,,,,,,,,,,,PDF,,,,,,,,,,,,,,,,,,,,,,,,,,,,,,,,,,,,https://digitalsc.lib.vt.edu/files/original/3614/CT_Vol87_No45_1991_0301_pgA2.pdf,Document,"Collegiate Times LGBTQ Articles",1,0
"Tech Graduate with AIDS to Lecture",,"Sexual minorities",,,,,,"The Collegiate Times",1991-01-29,,,,,,,,,,,,,,,,,,,,,,,,,,,,,,,Articles,CT_Vol87_No36_1991_0129_pgA2,,,,,,,,,,,,,,,,,,,,,,,,,,,,,,,,,,,,,,,,,,,,,,,,,PDF,,,,,,,,,,,,,,,,,,,,,,,,,,,,,,,,,,,,https://digitalsc.lib.vt.edu/files/original/3616/CT_Vol87_No36_1991_0129_pgA2.pdf,Document,"Collegiate Times LGBTQ Articles",1,0
"Tech Gays 'Come Out'",,"Sexual minorities",,,,,,"The Collegiate Times",1975-11-18,,,,,,,,,,,,,,,,,,,,,,,,,,,,,,,Articles,CT_Vol72_No15_1975_1118_pg5,,,,,,,,,,,,,,,,,,,,,,,,,,,,,,,,,,,,,,,,,,,,,,,,,PDF,,,,,,,,,,,,,,,,,,,,,,,,,,,,,,,,,,,,https://digitalsc.lib.vt.edu/files/original/3751/CT_Vol72_No15_1975_1118_pg5.pdf,Document,"Collegiate Times LGBTQ Articles",1,0
"Tech Chosen to Participate in National AIDS Colloquium",,"Sexual minorities",,,,,,"The Collegiate Times",1986-05-30,,,,,,,,,,,,,,,,,,,,,,,,,,,,,,,Articles,CT_Vol82_No58_1986_0530,,,,,,,,,,,,,,,,,,,,,,,,,,,,,,,,,,,,,,,,,,,,,,,,,PDF,,,,,,,,,,,,,,,,,,,,,,,,,,,,,,,,,,,,https://digitalsc.lib.vt.edu/files/original/3667/CT_Vol82_No58_1986_0530.pdf,Document,"Collegiate Times LGBTQ Articles",1,0
"Students to Spread AIDS Awareness",,"Sexual minorities",,,,,,"The Collegiate Times",1989-04-11,,,,,,,,,,,,,,,,,,,,,,,,,,,,,,,Articles,CT_Vol85_No54_1989_0411,,,,,,,,,,,,,,,,,,,,,,,,,,,,,,,,,,,,,,,,,,,,,,,,,PDF,,,,,,,,,,,,,,,,,,,,,,,,,,,,,,,,,,,,https://digitalsc.lib.vt.edu/files/original/3655/CT_Vol85_No54_1989_0411.pdf,Document,"Collegiate Times LGBTQ Articles",1,0
"Students Should Ban AIDS",,"Sexual minorities",,,,,,"The Collegiate Times",1989-10-10,,,,,,,,,,,,,,,,,,,,,,,,,,,,,,,Articles,CT_Vol86_No15_1989_1010_pgA10,,,,,,,,,,,,,,,,,,,,,,,,,,,,,,,,,,,,,,,,,,,,,,,,,PDF,,,,,,,,,,,,,,,,,,,,,,,,,,,,,,,,,,,,https://digitalsc.lib.vt.edu/files/original/3648/CT_Vol86_No15_1989_1010_pgA10.pdf,Document,"Collegiate Times LGBTQ Articles",1,0
"Students Defy Old Norms to Protest for LGBT Rights",,"Sexual minorities",,,,,,"The Collegiate Times",2006-02-15,,,,,,,,,,,,,,,,,,,,,,,,,,,,,,,Articles,CT_Vol103_No76_2006_0212_pg1,,,,,,,,,,,,,,,,,,,,,,,,,,,,,,,,,,,,,,,,,,,,,,,,,PDF,,,,,,,,,,,,,,,,,,,,,,,,,,,,,,,,,,,,https://digitalsc.lib.vt.edu/files/original/4055/CT_Vol103_No76_2006_0212_pg1.pdf,Document,"Collegiate Times LGBTQ Articles",1,0
"Student Group Offers Gay Community Support",,"Sexual minorities",,,,"Edwards, Gregory Allen",,"The Collegiate Times",1985-02-01,,,,,,,,,,,,,,,,,,,,,,,,,,,,,,,Articles,CT_Vol81_No30_1985_0201,,,,,,,,,,,,,,,,,,,,,,,,,,,,,,,,,,,,,,,,,,,,,,,,,PDF,,,,,,,,,,,,,,,,,,,,,,,,,,,,,,,,,,,,https://digitalsc.lib.vt.edu/files/original/3689/CT_Vol81_No30_1985_0201.pdf,Document,"Collegiate Times LGBTQ Articles",1,0
"Straight Sex Week Coming [printed in the April Fools edition]",,"Sexual minorities",,,,,,"The Collegiate Times",1978-03-30,,,,,,,,,,,,,,,,,,,,,,,,,,,,,,,Articles,CT_Vol75_No3_1979_0330_pgA3,,,,,,,,,,,,,,,,,,,,,,,,,,,,,,,,,,,,,,,,,,,,,,,,,PDF,,,,,,,,,,,,,,,,,,,,,,,,,,,,,,,,,,,,https://digitalsc.lib.vt.edu/files/original/3720/CT_Vol75_No3_1979_0330_pgA3.pdf,Document,"Collegiate Times LGBTQ Articles",1,0
"Sexuality Discussed Openly",,"Sexual minorities",,,,,,"The Collegiate Times",1984-11-13,,,,,,,,,,,,,,,,,,,,,,,,,,,,,,,Articles,CT_Vol81_No17_1984_1113_pgC2,,,,,,,,,,,,,,,,,,,,,,,,,,,,,,,,,,,,,,,,,,,,,,,,,PDF,,,,,,,,,,,,,,,,,,,,,,,,,,,,,,,,,,,,https://digitalsc.lib.vt.edu/files/original/3691/CT_Vol81_No17_1984_1113_pgC2.pdf,Document,"Collegiate Times LGBTQ Articles",1,0
"Sensitive Issues Addressed by SGA",,"Sexual minorities",,,,,,"The Collegiate Times",1990-09-14,,,,,,,,,,,,,,,,,,,,,,,,,,,,,,,Articles,CT_Vol87_No06_1990_0914_pgA3,,,,,,,,,,,,,,,,,,,,,,,,,,,,,,,,,,,,,,,,,,,,,,,,,PDF,,,,,,,,,,,,,,,,,,,,,,,,,,,,,,,,,,,,https://digitalsc.lib.vt.edu/files/original/3634/CT_Vol87_No06_1990_0914_pgA3.pdf,Document,"Collegiate Times LGBTQ Articles",1,0
"Remember Their Names, advertisement for the Names Project AIDS Memorial Quilt held on March 29, 1990, sponsored by Lambda Horizons",,"Sexual minorities",,,,,,"The Collegiate Times",1991-03-26,,,,,,,,,,,,,,,,,,,,,,,,,,,,,,,Articles,CT_Vol87_No50_1991_0326_pgA11,,,,,,,,,,,,,,,,,,,,,,,,,,,,,,,,,,,,,,,,,,,,,,,,,PDF,,,,,,,,,,,,,,,,,,,,,,,,,,,,,,,,,,,,https://digitalsc.lib.vt.edu/files/original/3609/CT_Vol87_No50_1991_0326_pgA11.pdf,Document,"Collegiate Times LGBTQ Articles",1,0
"Remember the Names AIDS Quilt Project advertisement",,"Sexual minorities",,,,,,"The Collegiate Times",1989-10-20,,,,,,,,,,,,,,,,,,,,,,,,,,,,,,,Articles,CT_Vol86_No18_1989_1020_pgA2,,,,,,,,,,,,,,,,,,,,,,,,,,,,,,,,,,,,,,,,,,,,,,,,,PDF,,,,,,,,,,,,,,,,,,,,,,,,,,,,,,,,,,,,https://digitalsc.lib.vt.edu/files/original/3647/CT_Vol86_No18_1989_1020_pgA2.pdf,Document,"Collegiate Times LGBTQ Articles",1,0
"Remember the Names AIDS Quilt Project advertisement",,"Sexual minorities",,,,,,"The Collegiate Times",1989-10-27,,,,,,,,,,,,,,,,,,,,,,,,,,,,,,,Articles,CT_Vol86_No20_1989_1027_pgA5,,,,,,,,,,,,,,,,,,,,,,,,,,,,,,,,,,,,,,,,,,,,,,,,,PDF,,,,,,,,,,,,,,,,,,,,,,,,,,,,,,,,,,,,https://digitalsc.lib.vt.edu/files/original/3643/CT_Vol86_No20_1989_1027_pgA5.pdf,Document,"Collegiate Times LGBTQ Articles",1,0
"Religion Question Draws Fire",,"Sexual minorities",,,,"Edwards, Gregory Allen",,"The Collegiate Times",1985-02-12,,,,,,,,,,,,,,,,,,,,,,,,,,,,,,,Articles,CT_Vol81_No33_1985_0212,,,,,,,,,,,,,,,,,,,,,,,,,,,,,,,,,,,,,,,,,,,,,,,,,PDF,,,,,,,,,,,,,,,,,,,,,,,,,,,,,,,,,,,,https://digitalsc.lib.vt.edu/files/original/3686/CT_Vol81_No33_1985_0212.pdf,Document,"Collegiate Times LGBTQ Articles",1,0
"Plane Trip Turns into Unexpected Gay Experience",,"Sexual minorities",,,,,,"The Collegiate Times",1980-01-25,,,,,,,,,,,,,,,,,,,,,,,,,,,,,,,Articles,CT_Vol76_No26_1980_0125_pg6,,,,,,,,,,,,,,,,,,,,,,,,,,,,,,,,,,,,,,,,,,,,,,,,,PDF,,,,,,,,,,,,,,,,,,,,,,,,,,,,,,,,,,,,https://digitalsc.lib.vt.edu/files/original/3702/CT_Vol76_No26_1980_0125_pg6.pdf,Document,"Collegiate Times LGBTQ Articles",1,0
"Panel Looks at AIDS",,"Sexual minorities",,,,,,"The Collegiate Times",1990-03-30,,,,,,,,,,,,,,,,,,,,,,,,,,,,,,,Articles,CT_Vol86_No51_1990_0330_pgA1,,,,,,,,,,,,,,,,,,,,,,,,,,,,,,,,,,,,,,,,,,,,,,,,,PDF,,,,,,,,,,,,,,,,,,,,,,,,,,,,,,,,,,,,https://digitalsc.lib.vt.edu/files/original/3640/CT_Vol86_No51_1990_0330_pgA1.pdf,Document,"Collegiate Times LGBTQ Articles",1,0
"New Ticket Policies",,"Sexual minorities",,,,,,"The Collegiate Times",1986-05-20,,,,,,,,,,,,,,,,,,,,,,,,,,,,,,,Articles,CT_Vol82_No55_1986_0520_pgA4,,,,,,,,,,,,,,,,,,,,,,,,,,,,,,,,,,,,,,,,,,,,,,,,,PDF,,,,,,,,,,,,,,,,,,,,,,,,,,,,,,,,,,,,https://digitalsc.lib.vt.edu/files/original/3668/CT_Vol82_No55_1986_0520_pgA4.pdf,Document,"Collegiate Times LGBTQ Articles",1,0
"New SGA leaders","Willis and Billingsley assume authority","University History",,,,,,"The Collegiate Times",2017-04-16,,,,,,,,,,,,,,,,,,,,,,,,,,,,,,,Articles,CT_2017_04_16_p1,,,,,,,,,,,,,,,,,,,,,,,,,,,,,,,,,,,,,,,,,,,,,,,,,PDF,,,,,,,,,,,,,,,,,,,,,,,,,,,,,,,,,,,,https://digitalsc.lib.vt.edu/files/original/a62de8cfee05501fa2fd5d007d8c8ff7.pdf,Document,"Collegiate Times LGBTQ Articles",1,0
"New Resolutions",,"Sexual minorities",,,,,,"The Collegiate Times",1990-10-02,,,,,,,,,,,,,,,,,,,,,,,,,,,,,,,Articles,CT_Vol87_No11_1990_1002_pgA4,,,,,,,,,,,,,,,,,,,,,,,,,,,,,,,,,,,,,,,,,,,,,,,,,PDF,,,,,,,,,,,,,,,,,,,,,,,,,,,,,,,,,,,,https://digitalsc.lib.vt.edu/files/original/3633/CT_Vol87_No11_1990_1002_pgA4.pdf,Document,"Collegiate Times LGBTQ Articles",1,0
"New Lambda Horizon Meeting advertisement",,"Sexual minorities",,,,,,"The Collegiate Times",1991-03-26,,,,,,,,,,,,,,,,,,,,,,,,,,,,,,,Articles,CT_Vol87_No50_1991_0326_pgA6,,,,,,,,,,,,,,,,,,,,,,,,,,,,,,,,,,,,,,,,,,,,,,,,,PDF,,,,,,,,,,,,,,,,,,,,,,,,,,,,,,,,,,,,https://digitalsc.lib.vt.edu/files/original/3610/CT_Vol87_No50_1991_0326_pgA6.pdf,Document,"Collegiate Times LGBTQ Articles",1,0
"Misunderstood Lifestyle",,"Sexual minorities",,,,,,"The Collegiate Times",1988-02-16,,,,,,,,,,,,,,,,,,,,,,,,,,,,,,,Articles,CT_Vol84_No37_1988_0216_pgA4,,,,,,,,,,,,,,,,,,,,,,,,,,,,,,,,,,,,,,,,,,,,,,,,,PDF,,,,,,,,,,,,,,,,,,,,,,,,,,,,,,,,,,,,https://digitalsc.lib.vt.edu/files/original/3662/CT_Vol84_No37_1988_0216_pgA4.pdf,Document,"Collegiate Times LGBTQ Articles",1,0
"Memorial AIDS Quilt to Visit Tech",,"Sexual minorities",,,,,,"The Collegiate Times",1991-03-29,,,,,,,,,,,,,,,,,,,,,,,,,,,,,,,Articles,CT_Vol87_No51_1991_0329,,,,,,,,,,,,,,,,,,,,,,,,,,,,,,,,,,,,,,,,,,,,,,,,,PDF,,,,,,,,,,,,,,,,,,,,,,,,,,,,,,,,,,,,https://digitalsc.lib.vt.edu/files/original/3608/CT_Vol87_No51_1991_0329.pdf,Document,"Collegiate Times LGBTQ Articles",1,0
"Life Fest: Musicians Band for AIDS",,"Sexual minorities",,,,,,"The Collegiate Times",1989-07-31,,,,,,,,,,,,,,,,,,,,,,,,,,,,,,,Articles,CT_Vol85_No60_1989_0731,,,,,,,,,,,,,,,,,,,,,,,,,,,,,,,,,,,,,,,,,,,,,,,,,PDF,,,,,,,,,,,,,,,,,,,,,,,,,,,,,,,,,,,,https://digitalsc.lib.vt.edu/files/original/3650/CT_Vol85_No60_1989_0731.pdf,Document,"Collegiate Times LGBTQ Articles",1,0
"Life Fest II Concer Set for Fall",,"Sexual minorities",,,,,,"The Collegiate Times",1990-04-24,,,,,,,,,,,,,,,,,,,,,,,,,,,,,,,Articles,CT_Vol86_No58_1990_0424_pgA2a,,,,,,,,,,,,,,,,,,,,,,,,,,,,,,,,,,,,,,,,,,,,,,,,,PDF,,,,,,,,,,,,,,,,,,,,,,,,,,,,,,,,,,,,https://digitalsc.lib.vt.edu/files/original/3637/CT_Vol86_No58_1990_0424_pgA2a.pdf,Document,"Collegiate Times LGBTQ Articles",1,0
"Life Fest Album Release Party advertisement",,"Sexual minorities",,,,,,"The Collegiate Times",1989-10-24,,,,,,,,,,,,,,,,,,,,,,,,,,,,,,,Articles,CT_Vol86_No19_1989_1024_pgA6,,,,,,,,,,,,,,,,,,,,,,,,,,,,,,,,,,,,,,,,,,,,,,,,,PDF,,,,,,,,,,,,,,,,,,,,,,,,,,,,,,,,,,,,https://digitalsc.lib.vt.edu/files/original/3646/CT_Vol86_No19_1989_1024_pgA6.pdf,Document,"Collegiate Times LGBTQ Articles",1,0
"LGBT campus climate reviewed",,"LGBTQ+ History",,,,,,"The Collegiate Times",2010-09-22,,,,,,,,,,,,,,,,,,,,,,,,,,,,,,,Articles,CT_2010_09_22_p1,,,,,,,,,,,,,,,,,,,,,,,,,,,,,,,,,,,,,,,,,,,,,,,,,PDF,,,,,,,,,,,,,,,,,,,,,,,,,,,,,,,,,,,,https://digitalsc.lib.vt.edu/files/original/b94e265013ac113a9a07fcd071a4c4b7.pdf,Document,"Collegiate Times LGBTQ Articles",1,0
"Letters to the editors, Purpose of Denim Day Not a Head Count",,"Sexual minorities",,,,,,"The Collegiate Times",1979-01-23,,,,,,,,,,,,,,,,,,,,,,,,,,,,,,,Articles,CT_Vol75_No25_1979_0123_pg4,,,,,,,,,,,,,,,,,,,,,,,,,,,,,,,,,,,,,,,,,,,,,,,,,PDF,,,,,,,,,,,,,,,,,,,,,,,,,,,,,,,,,,,,https://digitalsc.lib.vt.edu/files/original/3709/CT_Vol75_No25_1979_0123_pg4.pdf,Document,"Collegiate Times LGBTQ Articles",1,0
"Letters to the editor, Point-Counter Point: Denim Day and Gay Awareness",,"Sexual minorities",,,,,,"The Collegiate Times",1979-01-16,,,,,,,,,,,,,,,,,,,,,,,,,,,,,,,Articles,CT_Vol75_No23_1979_0116_pg6,,,,,,,,,,,,,,,,,,,,,,,,,,,,,,,,,,,,,,,,,,,,,,,,,PDF,,,,,,,,,,,,,,,,,,,,,,,,,,,,,,,,,,,,https://digitalsc.lib.vt.edu/files/original/3711/CT_Vol75_No23_1979_0116_pg6.pdf,Document,"Collegiate Times LGBTQ Articles",1,0
"Letters to the editor, Gay 'Denim Day' Draws Flak",,"Sexual minorities",,,,,,"The Collegiate Times",1979-01-12,,,,,,,,,,,,,,,,,,,,,,,,,,,,,,,Articles,CT_Vol75_No22_1979_0112_pg6,,,,,,,,,,,,,,,,,,,,,,,,,,,,,,,,,,,,,,,,,,,,,,,,,PDF,,,,,,,,,,,,,,,,,,,,,,,,,,,,,,,,,,,,https://digitalsc.lib.vt.edu/files/original/3712/CT_Vol75_No22_1979_0112_pg6.pdf,Document,"Collegiate Times LGBTQ Articles",1,0
"Letters to the editor about homosexuality",,"Sexual minorities",,,,,,"The Collegiate Times",1975-04-25,,,,,,,,,,,,,,,,,,,,,,,,,,,,,,,Articles,CT_Vol71_No25_1975_0425_pg2,,,,,,,,,,,,,,,,,,,,,,,,,,,,,,,,,,,,,,,,,,,,,,,,,PDF,,,,,,,,,,,,,,,,,,,,,,,,,,,,,,,,,,,,https://digitalsc.lib.vt.edu/files/original/3754/CT_Vol71_No25_1975_0425_pg2.pdf,Document,"Collegiate Times LGBTQ Articles",1,0
"Letter to the editor, Vandalism Must End",,"Sexual minorities",,,,,,"The Collegiate Times",1990-10-16,,,,,,,,,,,,,,,,,,,,,,,,,,,,,,,Articles,CT_Vol87_No15_1990_1016_pgA5,,,,,,,,,,,,,,,,,,,,,,,,,,,,,,,,,,,,,,,,,,,,,,,,,PDF,,,,,,,,,,,,,,,,,,,,,,,,,,,,,,,,,,,,https://digitalsc.lib.vt.edu/files/original/3627/CT_Vol87_No15_1990_1016_pgA5.pdf,Document,"Collegiate Times LGBTQ Articles",1,0
"Letter to the editor, The Biblical Views on Gays",,"Sexual minorities",,,,,,"The Collegiate Times",1985-03-01,,,,,,,,,,,,,,,,,,,,,,,,,,,,,,,Articles,CT_Vol81_No38_1985_0301_pgA4,,,,,,,,,,,,,,,,,,,,,,,,,,,,,,,,,,,,,,,,,,,,,,,,,PDF,,,,,,,,,,,,,,,,,,,,,,,,,,,,,,,,,,,,https://digitalsc.lib.vt.edu/files/original/3683/CT_Vol81_No38_1985_0301_pgA4.pdf,Document,"Collegiate Times LGBTQ Articles",1,0
"Letter to the editor, SGA Fears Anti-gay Accusation, response to Lack of Representation on April 4, 1989",,"Sexual minorities",,,,,,"The Collegiate Times",1989-04-07,,,,,,,,,,,,,,,,,,,,,,,,,,,,,,,Articles,CT_Vol85_No53_1989_0407_pgA5,,,,,,,,,,,,,,,,,,,,,,,,,,,,,,,,,,,,,,,,,,,,,,,,,PDF,,,,,,,,,,,,,,,,,,,,,,,,,,,,,,,,,,,,https://digitalsc.lib.vt.edu/files/original/3656/CT_Vol85_No53_1989_0407_pgA5.pdf,Document,"Collegiate Times LGBTQ Articles",1,0
"Letter to the editor, Rights Belong to Everyone, response to Homosexual Rights Questioned letter on October 8, 1991",,"Sexual minorities",,,,,,"The Collegiate Times",1991-10-11,,,,,,,,,,,,,,,,,,,,,,,,,,,,,,,Articles,CT_Vol88_No14_1991_1011_pgA12a,,,,,,,,,,,,,,,,,,,,,,,,,,,,,,,,,,,,,,,,,,,,,,,,,PDF,,,,,,,,,,,,,,,,,,,,,,,,,,,,,,,,,,,,https://digitalsc.lib.vt.edu/files/original/3601/CT_Vol88_No14_1991_1011_pgA12a.pdf,Document,"Collegiate Times LGBTQ Articles",1,0
"Letter to the editor, Riders on the Storm, response to letter on May 18, 1976",,"Sexual minorities",,,,,,"The Collegiate Times",1976-05-25,,,,,,,,,,,,,,,,,,,,,,,,,,,,,,,Articles,CT_Vol72_No56_1976_0525_pg2,,,,,,,,,,,,,,,,,,,,,,,,,,,,,,,,,,,,,,,,,,,,,,,,,PDF,,,,,,,,,,,,,,,,,,,,,,,,,,,,,,,,,,,,https://digitalsc.lib.vt.edu/files/original/3744/CT_Vol72_No56_1976_0525_pg2.pdf,Document,"Collegiate Times LGBTQ Articles",1,0
"Letter to the editor, response to Gay People at Virginia Tech Article from February 7, 1973",,"Sexual minorities",,,,,,"The Collegiate Times",1973-02-14,,,,,,,,,,,,,,,,,,,,,,,,,,,,,,,Articles,CT_Vol69_No16_1973_0214_pg2,,,,,,,,,,,,,,,,,,,,,,,,,,,,,,,,,,,,,,,,,,,,,,,,,PDF,,,,,,,,,,,,,,,,,,,,,,,,,,,,,,,,,,,,https://digitalsc.lib.vt.edu/files/original/3757/CT_Vol69_No16_1973_0214_pg2.pdf,Document,"Collegiate Times LGBTQ Articles",1,0
"Letter to the editor, response to Gay Liberation Front at Virginia Tech on January 20, 1971",,"Sexual minorities",,,,,,"The Collegiate Times",1971-02-03,,,,,,,,,,,,,,,,,,,,,,,,,,,,,,,Articles,CT_Vol66_No29_1971_0203_pg2,,,,,,,,,,,,,,,,,,,,,,,,,,,,,,,,,,,,,,,,,,,,,,,,,PDF,,,,,,,,,,,,,,,,,,,,,,,,,,,,,,,,,,,,https://digitalsc.lib.vt.edu/files/original/3762/CT_Vol66_No29_1971_0203_pg2.pdf,Document,"Collegiate Times LGBTQ Articles",1,0
"Letter to the editor, Protecting Sexual Orientation, in response to EOAA resolutions",,"Sexual minorities",,,,,,"The Collegiate Times",1990-04-24,,,,,,,,,,,,,,,,,,,,,,,,,,,,,,,Articles,CT_Vol86_No58_1990_0424_pgA5,,,,,,,,,,,,,,,,,,,,,,,,,,,,,,,,,,,,,,,,,,,,,,,,,PDF,,,,,,,,,,,,,,,,,,,,,,,,,,,,,,,,,,,,https://digitalsc.lib.vt.edu/files/original/3635/CT_Vol86_No58_1990_0424_pgA5.pdf,Document,"Collegiate Times LGBTQ Articles",1,0
"Letter to the editor, Offended by Fantasy Article",,"Sexual minorities",,,,,,"The Collegiate Times",1980-01-29,,,,,,,,,,,,,,,,,,,,,,,,,,,,,,,Articles,CT_Vol76_No27_1980_0129_pg4,,,,,,,,,,,,,,,,,,,,,,,,,,,,,,,,,,,,,,,,,,,,,,,,,PDF,,,,,,,,,,,,,,,,,,,,,,,,,,,,,,,,,,,,https://digitalsc.lib.vt.edu/files/original/3701/CT_Vol76_No27_1980_0129_pg4.pdf,Document,"Collegiate Times LGBTQ Articles",1,0
"Letter to the editor, No Joke, response to Dear Oz column",,"Sexual minorities",,,,,,"The Collegiate Times",1985-10-22,,,,,,,,,,,,,,,,,,,,,,,,,,,,,,,Articles,CT_Vol82_No08_1985_1022_pgA4,,,,,,,,,,,,,,,,,,,,,,,,,,,,,,,,,,,,,,,,,,,,,,,,,PDF,,,,,,,,,,,,,,,,,,,,,,,,,,,,,,,,,,,,https://digitalsc.lib.vt.edu/files/original/3680/CT_Vol82_No08_1985_1022_pgA4.pdf,Document,"Collegiate Times LGBTQ Articles",1,0
"Letter to the editor, Naturally Impulsed, response to ""Committing What is Shameful' letter on October 23, 1990",,"Sexual minorities",,,,,,"The Collegiate Times",1990-10-30,,,,,,,,,,,,,,,,,,,,,,,,,,,,,,,Articles,CT_Vol87_No19_1990_1030_pgA4c,,,,,,,,,,,,,,,,,,,,,,,,,,,,,,,,,,,,,,,,,,,,,,,,,PDF,,,,,,,,,,,,,,,,,,,,,,,,,,,,,,,,,,,,https://digitalsc.lib.vt.edu/files/original/3622/CT_Vol87_No19_1990_1030_pgA4c.pdf,Document,"Collegiate Times LGBTQ Articles",1,0
"Letter to the editor, It Is a Sin",,"Sexual minorities",,,,,,"The Collegiate Times",1979-03-30,,,,,,,,,,,,,,,,,,,,,,,,,,,,,,,Articles,CT_Vol75_No39_1979_0330_pg7,,,,,,,,,,,,,,,,,,,,,,,,,,,,,,,,,,,,,,,,,,,,,,,,,PDF,,,,,,,,,,,,,,,,,,,,,,,,,,,,,,,,,,,,https://digitalsc.lib.vt.edu/files/original/3706/CT_Vol75_No39_1979_0330_pg7.pdf,Document,"Collegiate Times LGBTQ Articles",1,0
