﻿"Item Id","Item URI","Dublin Core:Title","Dublin Core:Alternative Title","Dublin Core:Subject","Dublin Core:Description","Dublin Core:Abstract","Dublin Core:Table Of Contents","Dublin Core:Creator","Dublin Core:Source","Dublin Core:Publisher","Dublin Core:Date","Dublin Core:Date Available","Dublin Core:Date Created","Dublin Core:Date Accepted","Dublin Core:Date Copyrighted","Dublin Core:Date Submitted","Dublin Core:Date Issued","Dublin Core:Date Modified","Dublin Core:Date Valid","Dublin Core:Contributor","Dublin Core:Rights","Dublin Core:Access Rights","Dublin Core:License","Dublin Core:Relation","Dublin Core:Conforms To","Dublin Core:Has Format","Dublin Core:Has Part","Dublin Core:Has Version","Dublin Core:Is Format Of","Dublin Core:Is Part Of","Dublin Core:Is Referenced By","Dublin Core:Is Replaced By","Dublin Core:Is Required By","Dublin Core:Is Version Of","Dublin Core:References","Dublin Core:Replaces","Dublin Core:Requires","Dublin Core:Format","Dublin Core:Extent","Dublin Core:Medium","Dublin Core:Language","Dublin Core:Type","Dublin Core:Identifier","Dublin Core:Bibliographic Citation","Dublin Core:Coverage","Dublin Core:Spatial Coverage","Dublin Core:Temporal Coverage","Dublin Core:Accrual Method","Dublin Core:Accrual Periodicity","Dublin Core:Accrual Policy","Dublin Core:Audience","Dublin Core:Audience Education Level","Dublin Core:Mediator","Dublin Core:Instructional Method","Dublin Core:Provenance","Dublin Core:Rights Holder","Item Type Metadata:Text","Item Type Metadata:Interviewer","Item Type Metadata:Interviewee","Item Type Metadata:Location","Item Type Metadata:Transcription","Item Type Metadata:Local URL","Item Type Metadata:Original Format","Item Type Metadata:Physical Dimensions","Item Type Metadata:Duration","Item Type Metadata:Compression","Item Type Metadata:Producer","Item Type Metadata:Director","Item Type Metadata:Bit Rate/Frequency","Item Type Metadata:Time Summary","Item Type Metadata:Email Body","Item Type Metadata:Subject Line","Item Type Metadata:From","Item Type Metadata:To","Item Type Metadata:CC","Item Type Metadata:BCC","Item Type Metadata:Number of Attachments","Item Type Metadata:Standards","Item Type Metadata:Objectives","Item Type Metadata:Materials","Item Type Metadata:Lesson Plan Text","Item Type Metadata:URL","Item Type Metadata:Event Type","Item Type Metadata:Participants","Item Type Metadata:Birth Date","Item Type Metadata:Birthplace","Item Type Metadata:Death Date","Item Type Metadata:Occupation","Item Type Metadata:Biographical Text","Item Type Metadata:Bibliography","Item Type Metadata:Transcript","Item Type Metadata:Viewer","Item Type Metadata:Player","Item Type Metadata:Frame Rate","Item Type Metadata:Display Resolution","Item Type Metadata:Production Team","Item Type Metadata:Narrator","Omeka Legacy File:Additional Creator","Omeka Legacy File:Transcriber","Omeka Legacy File:Producer","Omeka Legacy File:Render Device","Omeka Legacy File:Render Details","Omeka Legacy File:Capture Date","Omeka Legacy File:Capture Device","Omeka Legacy File:Capture Details","Omeka Legacy File:Change History","Omeka Legacy File:Watermark","Omeka Legacy File:Encryption","Omeka Legacy File:Compression","Omeka Legacy File:Post Processing","Omeka Image File:Width","Omeka Image File:Height","Omeka Image File:Bit Depth","Omeka Image File:Channels","Omeka Image File:Exif String","Omeka Image File:Exif Array","Omeka Image File:IPTC String","Omeka Image File:IPTC Array","Omeka Video File:Bitrate","Omeka Video File:Duration","Omeka Video File:Sample Rate","Omeka Video File:Codec","Omeka Video File:Width","Omeka Video File:Height","PDF Text:Text",tags,file,itemType,collection,public,featured
13360,https://digitalsc.lib.vt.edu/items/show/13360,"Elevations and sections, Gottlieb house, Fairfax Station, Va., March 1995 (Ms1997-003)",,"International Archive of Women in Architecture (IAWA)","Elevations and sections for the Mark and Sharon Gottlieb residence. Diazotype print.",,,"Gottlieb, Lois Davidson, 1926-2018","Please consult the <a href=""https://ead.lib.virginia.edu/vivaxtf/view?docId=vt/viblbv00125.xml"">Guide to the Lois Davidson Gottlieb Architectural Collection</a> for more information.",,1995,,,,,,,,,,"This Item is protected by copyright and/or related rights. You are free to use this Item in any way that is permitted by the copyright and related rights legislation that applies to your use. In addition, no permission is required from the rights-holder(s) for educational uses. For other uses, you need to obtain permission from the rights-holder(s). https://rightsstatements.org/page/InC-EDU/1.0/?language=en",,,,,,,,,"Ms1997-003^^Ms1997-003, Folder 2^^Mark and Sharon Gottlieb Residence",,,,,,,,image/jpg,,,English,"Architectural drawings",Ms1997_003_MC13_D3_F002_001_Gottlieb_Dr_016,"Researchers wishing to cite this collection should include the following information: Lois Davidson Gottlieb Architectural Collection, Ms1997-003, Special Collections and University Archives, Virginia Tech, Blacksburg, Va.",,,,,,,,,,,,"Special Collections and University Archives, Virginia Tech",,,,,,,,,,,,,,,,,,,,,,,,,,,,,,,,,,,,,,,,,,,,,,,,,,,,,,,,,,,,,,,,,,,,,,"Ms1997-003~Ms1997-003, Folder 2~Mark and Sharon Gottlieb Residence",https://digitalsc.lib.vt.edu/files/original/f4fa721173ee24b3d943dc04e46a6a42.jpeg,Document,"Lois Davidson Gottlieb Architectural Collection",1,0
13359,https://digitalsc.lib.vt.edu/items/show/13359,"Elevations, Gottlieb house, Fairfax Station, Va., March 1995 (Ms1997-003)",,"International Archive of Women in Architecture (IAWA)","Elevations for walls and master bedroom for the Mark and Sharon Gottlieb residence. Diazotype print.",,,"Gottlieb, Lois Davidson, 1926-2018","Please consult the <a href=""https://ead.lib.virginia.edu/vivaxtf/view?docId=vt/viblbv00125.xml"">Guide to the Lois Davidson Gottlieb Architectural Collection</a> for more information.",,1995,,,,,,,,,,"This Item is protected by copyright and/or related rights. You are free to use this Item in any way that is permitted by the copyright and related rights legislation that applies to your use. In addition, no permission is required from the rights-holder(s) for educational uses. For other uses, you need to obtain permission from the rights-holder(s). https://rightsstatements.org/page/InC-EDU/1.0/?language=en",,,,,,,,,"Ms1997-003^^Ms1997-003, Folder 2^^Mark and Sharon Gottlieb Residence",,,,,,,,image/jpg,,,English,"Architectural drawings",Ms1997_003_MC13_D3_F002_001_Gottlieb_Dr_015,"Researchers wishing to cite this collection should include the following information: Lois Davidson Gottlieb Architectural Collection, Ms1997-003, Special Collections and University Archives, Virginia Tech, Blacksburg, Va.",,,,,,,,,,,,"Special Collections and University Archives, Virginia Tech",,,,,,,,,,,,,,,,,,,,,,,,,,,,,,,,,,,,,,,,,,,,,,,,,,,,,,,,,,,,,,,,,,,,,,"Ms1997-003~Ms1997-003, Folder 2~Mark and Sharon Gottlieb Residence",https://digitalsc.lib.vt.edu/files/original/d0d565b2e55341a85dbed855d1c46343.jpeg,Document,"Lois Davidson Gottlieb Architectural Collection",1,0
12994,https://digitalsc.lib.vt.edu/items/show/12994,"Entrance plan and interior elevations for Vine Terrace Apartments, San Francisco, Ca., January 3, 1972 (Ms1992-019)",,"Architects and community^^Architecture--Computer-aided design^^City planning^^Housing--United States^^International Archive of Women in Architecture (IAWA)","Pine Street entrance plans and interior elevations for Vine Terrace, renamed Nob Hill, Apartments. Project #0594",,,"Willis, Beverly, 1928-","<a href=""https://ead.lib.virginia.edu/vivaxtf/view?docId=vt/viblbv00072.xml"">See the finding aid for the Beverly Willis Architectural Collection</a>",,1/3/72,,,,,,,,,,"This Item is protected by copyright and/or related rights. You are free to use this Item in any way that is permitted by the copyright and related rights legislation that applies to your use. In addition, no permission is required from the rights-holder(s) for educational uses. For other uses, you need to obtain permission from the rights-holder(s). https://rightsstatements.org/page/InC-EDU/1.0/?language=en",,,,,,,,,"Ms1992-019, Map case 20",,,,,,,,image/jpg,,,English,"Architectural drawings",Ms1992_019_MC20_D05_F22_VineTerrace_Dr_009,"Researchers wishing to cite this collection should include the following information: Beverly Willis Architectural Collection, Ms1992-019, Special Collections and University Archives, Virginia Tech, Blacksburg, Va.",,,,,,,,,,,,"Special Collections and University Archives, Virginia Tech",,,,,,,,,,,,,,,,,,,,,,,,,,,,,,,,,,,,,,,,,,,,,,,,,,,,,,,,,,,,,,,,,,,,,,,https://digitalsc.lib.vt.edu/files/original/cce01f5db81c765423d016c9b52f0e44.jpg,"Still Image","Beverly Willis Architectural Collection, 1954 - 1999",1,0
12991,https://digitalsc.lib.vt.edu/items/show/12991,"Exterior elevation for Vine Terrace Apartments, San Francisco, Ca., September 30, 1970 (Ms1992-019)",,"Architects and community^^Architecture--Computer-aided design^^City planning^^Housing--United States^^International Archive of Women in Architecture (IAWA)","South elevation along Pine Street for Vine Terrace, renamed Nob Hill, Apartments. Project #0594",,,"Willis, Beverly, 1928-","<a href=""https://ead.lib.virginia.edu/vivaxtf/view?docId=vt/viblbv00072.xml"">See the finding aid for the Beverly Willis Architectural Collection</a>",,9/30/70,,,,,,,,,,"This Item is protected by copyright and/or related rights. You are free to use this Item in any way that is permitted by the copyright and related rights legislation that applies to your use. In addition, no permission is required from the rights-holder(s) for educational uses. For other uses, you need to obtain permission from the rights-holder(s). https://rightsstatements.org/page/InC-EDU/1.0/?language=en",,,,,,,,,"Ms1992-019, Map case 20",,,,,,,,image/jpg,,,English,"Architectural drawings",Ms1992_019_MC20_D05_F22_VineTerrace_Dr_005,"Researchers wishing to cite this collection should include the following information: Beverly Willis Architectural Collection, Ms1992-019, Special Collections and University Archives, Virginia Tech, Blacksburg, Va.",,,,,,,,,,,,"Special Collections and University Archives, Virginia Tech",,,,,,,,,,,,,,,,,,,,,,,,,,,,,,,,,,,,,,,,,,,,,,,,,,,,,,,,,,,,,,,,,,,,,,,https://digitalsc.lib.vt.edu/files/original/9f91eb2081c7c8e2f90e0c55d0c270bf.jpg,"Still Image","Beverly Willis Architectural Collection, 1954 - 1999",1,0
13356,https://digitalsc.lib.vt.edu/items/show/13356,"Exterior elevations and sections, Gottlieb residence remodel, Olympia, Wa., 1973-1976 (Ms1997-003)",,"International Archive of Women in Architecture (IAWA)","Exterior elevations and sections for Gottlieb residence remodeling project. Pencil on paper.",,,"Gottlieb, Lois Davidson, 1926-2018","Please consult the <a href=""https://ead.lib.virginia.edu/vivaxtf/view?docId=vt/viblbv00125.xml"">Guide to the Lois Davidson Gottlieb Architectural Collection</a> for more information.",,1973,,,,,,,,,,"This Item is protected by copyright and/or related rights. You are free to use this Item in any way that is permitted by the copyright and related rights legislation that applies to your use. In addition, no permission is required from the rights-holder(s) for educational uses. For other uses, you need to obtain permission from the rights-holder(s). https://rightsstatements.org/page/InC-EDU/1.0/?language=en",,,,,,,,,"Ms1997-003^^Ms1997-003, Folder 5^^Gottlieb Residence Remodel",,,,,,,,image/jpg,,,English,"Architectural drawings",Ms1997_003_MC13_D3_F005_007_Gottlieb_Dr_003,"Researchers wishing to cite this collection should include the following information: Lois Davidson Gottlieb Architectural Collection, Ms1997-003, Special Collections and University Archives, Virginia Tech, Blacksburg, Va.",,,,,,,,,,,,"Special Collections and University Archives, Virginia Tech",,,,,,,,,,,,,,,,,,,,,,,,,,,,,,,,,,,,,,,,,,,,,,,,,,,,,,,,,,,,,,,,,,,,,,"Ms1997-003~Ms1997-003, Folder 5~Gottlieb Residence Remodel",https://digitalsc.lib.vt.edu/files/original/b2da95dddfc51518a125c080d4db914c.jpeg,Document,"Lois Davidson Gottlieb Architectural Collection",1,0
12987,https://digitalsc.lib.vt.edu/items/show/12987,"Exterior elevations for Pacific Point Condominiums, Pacifica, Ca., December 16, 1971 (Ms1992-019)",,"Architects and community^^Architecture--Computer-aided design^^City planning^^Housing--United States^^International Archive of Women in Architecture (IAWA)","Elevations for recreation building showing typical building materials for Pacific Point Condominiums. Project # 0577",,,"Willis, Beverly, 1928-","<a href=""https://ead.lib.virginia.edu/vivaxtf/view?docId=vt/viblbv00072.xml"">See the finding aid for the Beverly Willis Architectural Collection</a>",,12/16/71,,,,,,,,,,"This Item is protected by copyright and/or related rights. You are free to use this Item in any way that is permitted by the copyright and related rights legislation that applies to your use. In addition, no permission is required from the rights-holder(s) for educational uses. For other uses, you need to obtain permission from the rights-holder(s). https://rightsstatements.org/page/InC-EDU/1.0/?language=en",,,,,,,,,"Ms1992-019, Map case 20",,,,,,,,image/jpg,,,English,"Architectural drawings",Ms1992_019_MC20_D05_F21_PacificPoint_Dr_001,"Researchers wishing to cite this collection should include the following information: Beverly Willis Architectural Collection, Ms1992-019, Special Collections and University Archives, Virginia Tech, Blacksburg, Va.",,,,,,,,,,,,"Special Collections and University Archives, Virginia Tech",,,,,,,,,,,,,,,,,,,,,,,,,,,,,,,,,,,,,,,,,,,,,,,,,,,,,,,,,,,,,,,,,,,,,,,https://digitalsc.lib.vt.edu/files/original/2e0ac9761c101e62cfb4b09260027eff.jpg,"Still Image","Beverly Willis Architectural Collection, 1954 - 1999",1,0
12993,https://digitalsc.lib.vt.edu/items/show/12993,"Exterior elevations for Vine Terrace Apartments, San Francisco, Ca., January 3, 1972 (Ms1992-019)",,"Architects and community^^Architecture--Computer-aided design^^City planning^^Housing--United States^^International Archive of Women in Architecture (IAWA)","Pine Street and Vine Terrace building elevations for Vine Terrace, renamed Nob Hill, Apartments. Project #0594",,,"Willis, Beverly, 1928-","<a href=""https://ead.lib.virginia.edu/vivaxtf/view?docId=vt/viblbv00072.xml"">See the finding aid for the Beverly Willis Architectural Collection</a>",,1/3/72,,,,,,,,,,"This Item is protected by copyright and/or related rights. You are free to use this Item in any way that is permitted by the copyright and related rights legislation that applies to your use. In addition, no permission is required from the rights-holder(s) for educational uses. For other uses, you need to obtain permission from the rights-holder(s). https://rightsstatements.org/page/InC-EDU/1.0/?language=en",,,,,,,,,"Ms1992-019, Map case 20",,,,,,,,image/jpg,,,English,"Architectural drawings",Ms1992_019_MC20_D05_F22_VineTerrace_Dr_008,"Researchers wishing to cite this collection should include the following information: Beverly Willis Architectural Collection, Ms1992-019, Special Collections and University Archives, Virginia Tech, Blacksburg, Va.",,,,,,,,,,,,"Special Collections and University Archives, Virginia Tech",,,,,,,,,,,,,,,,,,,,,,,,,,,,,,,,,,,,,,,,,,,,,,,,,,,,,,,,,,,,,,,,,,,,,,,https://digitalsc.lib.vt.edu/files/original/5791380090e452450a3a817892dc9102.jpg,"Still Image","Beverly Willis Architectural Collection, 1954 - 1999",1,0
12995,https://digitalsc.lib.vt.edu/items/show/12995,"Exterior elevations for Vine Terrace Apartments, San Francisco, Ca., January 3, 1972 (Ms1992-019)",,"Architects and community^^Architecture--Computer-aided design^^City planning^^Housing--United States^^International Archive of Women in Architecture (IAWA)","North and courtyard elevations for Vine Terrace, renamed Nob Hill, Apartments. Project #0594",,,"Willis, Beverly, 1928-","<a href=""https://ead.lib.virginia.edu/vivaxtf/view?docId=vt/viblbv00072.xml"">See the finding aid for the Beverly Willis Architectural Collection</a>",,1/3/72,,,,,,,,,,"This Item is protected by copyright and/or related rights. You are free to use this Item in any way that is permitted by the copyright and related rights legislation that applies to your use. In addition, no permission is required from the rights-holder(s) for educational uses. For other uses, you need to obtain permission from the rights-holder(s). https://rightsstatements.org/page/InC-EDU/1.0/?language=en",,,,,,,,,"Ms1992-019, Map case 20",,,,,,,,image/jpg,,,English,"Architectural drawings",Ms1992_019_MC20_D05_F22_VineTerrace_Dr_010,"Researchers wishing to cite this collection should include the following information: Beverly Willis Architectural Collection, Ms1992-019, Special Collections and University Archives, Virginia Tech, Blacksburg, Va.",,,,,,,,,,,,"Special Collections and University Archives, Virginia Tech",,,,,,,,,,,,,,,,,,,,,,,,,,,,,,,,,,,,,,,,,,,,,,,,,,,,,,,,,,,,,,,,,,,,,,,https://digitalsc.lib.vt.edu/files/original/7c5d4b11d602b59b76fa230efd89d403.jpg,"Still Image","Beverly Willis Architectural Collection, 1954 - 1999",1,0
13372,https://digitalsc.lib.vt.edu/items/show/13372,"Exterior elevations, Gottlieb house, Riverside, Ca., 1964 (Ms1997-003)",,"International Archive of Women in Architecture (IAWA)","Elevations for adobe house in Riverside, Ca.",,,"Gottlieb, Lois Davidson, 1926-2018","Please consult the <a href=""https://ead.lib.virginia.edu/vivaxtf/view?docId=vt/viblbv00125.xml"">Guide to the Lois Davidson Gottlieb Architectural Collection</a> for more information.",,1964,,,,,,,,,,"This Item is protected by copyright and/or related rights. You are free to use this Item in any way that is permitted by the copyright and related rights legislation that applies to your use. In addition, no permission is required from the rights-holder(s) for educational uses. For other uses, you need to obtain permission from the rights-holder(s). https://rightsstatements.org/page/InC-EDU/1.0/?language=en",,,,,,,,,"Ms1997-003^^Ms1997-003, Folder 6^^Mr. and Mrs. Robert Gottlieb, Riverside Residence",,,,,,,,image/jpg,,,English,"Architectural drawings",Ms1997_003_MC13_D3_F006_002_Gottlieb_Dr_016,"Researchers wishing to cite this collection should include the following information: Lois Davidson Gottlieb Architectural Collection, Ms1997-003, Special Collections and University Archives, Virginia Tech, Blacksburg, Va.",,,,,,,,,,,,"Special Collections and University Archives, Virginia Tech",,,,,,,,,,,,,,,,,,,,,,,,,,,,,,,,,,,,,,,,,,,,,,,,,,,,,,,,,,,,,,,,,,,,,,"Ms1997-003~Ms1997-003, Folder 6~Mr. and Mrs. Robert Gottlieb, Riverside Residence",https://digitalsc.lib.vt.edu/files/original/dd5eea13a73687da32bd31bfc8d70a8c.jpeg,Document,"Lois Davidson Gottlieb Architectural Collection",1,0
13369,https://digitalsc.lib.vt.edu/items/show/13369,"Exterior elevations, Gottlieb house, San Francisco, Ca., 1955 (Ms1997-003)",,"International Archive of Women in Architecture (IAWA)","Partial elevation sketch, preliminary layout sketches for Gottliebs. Pencil on paper. ",,,"Gottlieb, Lois Davidson, 1926-2018","Please consult the <a href=""https://ead.lib.virginia.edu/vivaxtf/view?docId=vt/viblbv00125.xml"">Guide to the Lois Davidson Gottlieb Architectural Collection</a> for more information.",,1955,,,,,,,,,,"This Item is protected by copyright and/or related rights. You are free to use this Item in any way that is permitted by the copyright and related rights legislation that applies to your use. In addition, no permission is required from the rights-holder(s) for educational uses. For other uses, you need to obtain permission from the rights-holder(s). https://rightsstatements.org/page/InC-EDU/1.0/?language=en",,,,,,,,,"Ms1997-003^^Ms1997-003, Folder 6^^Mr. and Mrs. Robert Gottlieb, San Francisco Residence",,,,,,,,image/jpg,,,English,"Architectural drawings",Ms1997_003_MC13_D3_F006_001_Gottlieb_Dr_002,"Researchers wishing to cite this collection should include the following information: Lois Davidson Gottlieb Architectural Collection, Ms1997-003, Special Collections and University Archives, Virginia Tech, Blacksburg, Va.",,,,,,,,,,,,"Special Collections and University Archives, Virginia Tech",,,,,,,,,,,,,,,,,,,,,,,,,,,,,,,,,,,,,,,,,,,,,,,,,,,,,,,,,,,,,,,,,,,,,,"Ms1997-003~Ms1997-003, Folder 6~Mr. and Mrs. Robert Gottlieb, San Francisco Residence",https://digitalsc.lib.vt.edu/files/original/55596325ee0edabde2ccb3fac9dc738a.jpeg,Document,"Lois Davidson Gottlieb Architectural Collection",1,0
13355,https://digitalsc.lib.vt.edu/items/show/13355,"Exterior elevations, Gottlieb residence remodel, Olympia, Wa., 1973-1976 (Ms1997-003)",,"International Archive of Women in Architecture (IAWA)","Exterior elevations, including dock and wall elevations, for Gottlieb residence remodeling project. Pencil on paper.",,,"Gottlieb, Lois Davidson, 1926-2018","Please consult the <a href=""https://ead.lib.virginia.edu/vivaxtf/view?docId=vt/viblbv00125.xml"">Guide to the Lois Davidson Gottlieb Architectural Collection</a> for more information.",,1973,,,,,,,,,,"This Item is protected by copyright and/or related rights. You are free to use this Item in any way that is permitted by the copyright and related rights legislation that applies to your use. In addition, no permission is required from the rights-holder(s) for educational uses. For other uses, you need to obtain permission from the rights-holder(s). https://rightsstatements.org/page/InC-EDU/1.0/?language=en",,,,,,,,,"Ms1997-003^^Ms1997-003, Folder 5^^Gottlieb Residence Remodel",,,,,,,,image/jpg,,,English,"Architectural drawings",Ms1997_003_MC13_D3_F005_007_Gottlieb_Dr_002,"Researchers wishing to cite this collection should include the following information: Lois Davidson Gottlieb Architectural Collection, Ms1997-003, Special Collections and University Archives, Virginia Tech, Blacksburg, Va.",,,,,,,,,,,,"Special Collections and University Archives, Virginia Tech",,,,,,,,,,,,,,,,,,,,,,,,,,,,,,,,,,,,,,,,,,,,,,,,,,,,,,,,,,,,,,,,,,,,,,"Ms1997-003~Ms1997-003, Folder 5~Gottlieb Residence Remodel",https://digitalsc.lib.vt.edu/files/original/c2ab09b8993adf8ae026b6ce192279db.jpeg,Document,"Lois Davidson Gottlieb Architectural Collection",1,0
12938,https://digitalsc.lib.vt.edu/items/show/12938,"First floor plan for San Francisco Ballet Building Civic Center, San Francisco, Ca., 1983 (Ms1992-019)",,"Architects and community^^Architecture--Computer-aided design^^City planning^^Housing--United States^^International Archive of Women in Architecture (IAWA)","First floor plan on design vellum for the San Francisco Ballet Building, part of the Civic Center complex in San Francisco. Project #0753",,,"Willis, Beverly, 1928-","<a href=""https://ead.lib.virginia.edu/vivaxtf/view?docId=vt/viblbv00072.xml"">See the finding aid for the Beverly Willis Architectural Collection</a>",,1983,,,,,,,,,,"This Item is protected by copyright and/or related rights. You are free to use this Item in any way that is permitted by the copyright and related rights legislation that applies to your use. In addition, no permission is required from the rights-holder(s) for educational uses. For other uses, you need to obtain permission from the rights-holder(s). https://rightsstatements.org/page/InC-EDU/1.0/?language=en",,,,,,,,,"Ms1992-019, Map case 19",,,,,,,,image/jpg,,,English,"Architectural drawings",Ms1992_019_MC19_D04_F04_SFBalletBuilding_Dr_019,"Researchers wishing to cite this collection should include the following information: Beverly Willis Architectural Collection, Ms1992-019, Special Collections and University Archives, Virginia Tech, Blacksburg, Va.",,,,,,,,,,,,"Special Collections and University Archives, Virginia Tech",,,,,,,,,,,,,,,,,,,,,,,,,,,,,,,,,,,,,,,,,,,,,,,,,,,,,,,,,,,,,,,,,,,,,,,https://digitalsc.lib.vt.edu/files/original/b1a27d7d77e544dad58c22b92af8124c.jpg,"Still Image","Beverly Willis Architectural Collection, 1954 - 1999",1,0