﻿"Item Id","Item URI","Dublin Core:Title","Dublin Core:Alternative Title","Dublin Core:Subject","Dublin Core:Description","Dublin Core:Abstract","Dublin Core:Table Of Contents","Dublin Core:Creator","Dublin Core:Source","Dublin Core:Publisher","Dublin Core:Date","Dublin Core:Date Available","Dublin Core:Date Created","Dublin Core:Date Accepted","Dublin Core:Date Copyrighted","Dublin Core:Date Submitted","Dublin Core:Date Issued","Dublin Core:Date Modified","Dublin Core:Date Valid","Dublin Core:Contributor","Dublin Core:Rights","Dublin Core:Access Rights","Dublin Core:License","Dublin Core:Relation","Dublin Core:Conforms To","Dublin Core:Has Format","Dublin Core:Has Part","Dublin Core:Has Version","Dublin Core:Is Format Of","Dublin Core:Is Part Of","Dublin Core:Is Referenced By","Dublin Core:Is Replaced By","Dublin Core:Is Required By","Dublin Core:Is Version Of","Dublin Core:References","Dublin Core:Replaces","Dublin Core:Requires","Dublin Core:Format","Dublin Core:Extent","Dublin Core:Medium","Dublin Core:Language","Dublin Core:Type","Dublin Core:Identifier","Dublin Core:Bibliographic Citation","Dublin Core:Coverage","Dublin Core:Spatial Coverage","Dublin Core:Temporal Coverage","Dublin Core:Accrual Method","Dublin Core:Accrual Periodicity","Dublin Core:Accrual Policy","Dublin Core:Audience","Dublin Core:Audience Education Level","Dublin Core:Mediator","Dublin Core:Instructional Method","Dublin Core:Provenance","Dublin Core:Rights Holder","Item Type Metadata:Text","Item Type Metadata:Interviewer","Item Type Metadata:Interviewee","Item Type Metadata:Location","Item Type Metadata:Transcription","Item Type Metadata:Local URL","Item Type Metadata:Original Format","Item Type Metadata:Physical Dimensions","Item Type Metadata:Duration","Item Type Metadata:Compression","Item Type Metadata:Producer","Item Type Metadata:Director","Item Type Metadata:Bit Rate/Frequency","Item Type Metadata:Time Summary","Item Type Metadata:Email Body","Item Type Metadata:Subject Line","Item Type Metadata:From","Item Type Metadata:To","Item Type Metadata:CC","Item Type Metadata:BCC","Item Type Metadata:Number of Attachments","Item Type Metadata:Standards","Item Type Metadata:Objectives","Item Type Metadata:Materials","Item Type Metadata:Lesson Plan Text","Item Type Metadata:URL","Item Type Metadata:Event Type","Item Type Metadata:Participants","Item Type Metadata:Birth Date","Item Type Metadata:Birthplace","Item Type Metadata:Death Date","Item Type Metadata:Occupation","Item Type Metadata:Biographical Text","Item Type Metadata:Bibliography","Item Type Metadata:Transcript","Item Type Metadata:Viewer","Item Type Metadata:Player","Item Type Metadata:Frame Rate","Item Type Metadata:Display Resolution","Item Type Metadata:Production Team","Item Type Metadata:Narrator","Omeka Legacy File:Additional Creator","Omeka Legacy File:Transcriber","Omeka Legacy File:Producer","Omeka Legacy File:Render Device","Omeka Legacy File:Render Details","Omeka Legacy File:Capture Date","Omeka Legacy File:Capture Device","Omeka Legacy File:Capture Details","Omeka Legacy File:Change History","Omeka Legacy File:Watermark","Omeka Legacy File:Encryption","Omeka Legacy File:Compression","Omeka Legacy File:Post Processing","Omeka Image File:Width","Omeka Image File:Height","Omeka Image File:Bit Depth","Omeka Image File:Channels","Omeka Image File:Exif String","Omeka Image File:Exif Array","Omeka Image File:IPTC String","Omeka Image File:IPTC Array","Omeka Video File:Bitrate","Omeka Video File:Duration","Omeka Video File:Sample Rate","Omeka Video File:Codec","Omeka Video File:Width","Omeka Video File:Height","PDF Text:Text",tags,file,itemType,collection,public,featured
12578,https://digitalsc.lib.vt.edu/items/show/12578,"Scanned photograph of Solitude",,"Solitude (Blacksburg, Va.: Historic building)^^Blacksburg (Va.)^^Montgomery County (Va.)^^Local/Regional History and Appalachian South^^Virginia Polytechnic Institute and State University^^University History","B&W image, scanned photograph.",,,,"Historical Photograph Collection, Special Collections and University Archives, Virginia Tech",,,,,,,,,,,,"This Item is protected by copyright and/or related rights. You are free to use this Item in any way that is permitted by the copyright and related rights legislation that applies to your use. In addition, no permission is required from the rights-holder(s) for non-commercial uses. For other uses you need to obtain permission from the rights-holder(s). <a href=""https://rightsstatements.org/page/InC-NC/1.0/?language=en"" target=""_blank"" rel=""noreferrer noopener"">https://rightsstatements.org/page/InC-NC/1.0/?language=en</a>",,,,,,,,,"Historical Photograph Collection, Special Collections and University Archives",,,,,,,,image/jpg,,,"No language or script-based material",Photographs,SOL0001,"[image description], Historical Photograph Collection, Special Collections and University Archives, Virginia Tech",,,,,,,,,,,,"Special Collections and University Archives, Virginia Tech",,,,,,,,,,,,,,,,,,,,,,,,,,,,,,,,,,,,,,,,,,,,,,,,,,,,,,,,,,,,,,,,,,,,,,,https://digitalsc.lib.vt.edu/files/original/c40e51ea84036e3a9f64a6c46aa024d3.jpg,"Still Image","Historical Photograph Collection",1,0
12535,https://digitalsc.lib.vt.edu/items/show/12535,"Interior, workman measuring beams of building at Solitude",,"Solitude (Blacksburg, Va.: Historic building)^^Blacksburg (Va.)^^Montgomery County (Va.)^^Local/Regional History and Appalachian South^^Virginia Polytechnic Institute and State University^^University History","Color image.",,,,"Historical Photograph Collection, Special Collections and University Archives, Virginia Tech",,,,"1999-03-10 (image scanned) ",,,,,,,,"This Item is protected by copyright and/or related rights. You are free to use this Item in any way that is permitted by the copyright and related rights legislation that applies to your use. In addition, no permission is required from the rights-holder(s) for non-commercial uses. For other uses you need to obtain permission from the rights-holder(s). <a href=""https://rightsstatements.org/page/InC-NC/1.0/?language=en"" target=""_blank"" rel=""noreferrer noopener"">https://rightsstatements.org/page/InC-NC/1.0/?language=en</a>",,,,,,,,,"Historical Photograph Collection, Special Collections and University Archives",,,,,,,,image/jpg,,,"No language or script-based material",Photographs,08UASOL001,"[image description], Historical Photograph Collection, Special Collections and University Archives, Virginia Tech",,,,,,,,,,,,"Special Collections and University Archives, Virginia Tech",,,,,,,,,,,,,,,,,,,,,,,,,,,,,,,,,,,,,,,,,,,,,,,,,,,,,,,,,,,,,,,,,,,,,,,https://digitalsc.lib.vt.edu/files/original/57b47813a2b846d032c79d4aed4bf18d.jpg,"Still Image","Historical Photograph Collection",1,0
12538,https://digitalsc.lib.vt.edu/items/show/12538,"Interior, workman inside building at Solitude",,"Solitude (Blacksburg, Va.: Historic building)^^Blacksburg (Va.)^^Montgomery County (Va.)^^Local/Regional History and Appalachian South^^Virginia Polytechnic Institute and State University^^University History","Color image.",,,,"Historical Photograph Collection, Special Collections and University Archives, Virginia Tech",,,,"1999-03-10 (image scanned) ",,,,,,,,"This Item is protected by copyright and/or related rights. You are free to use this Item in any way that is permitted by the copyright and related rights legislation that applies to your use. In addition, no permission is required from the rights-holder(s) for non-commercial uses. For other uses you need to obtain permission from the rights-holder(s). <a href=""https://rightsstatements.org/page/InC-NC/1.0/?language=en"" target=""_blank"" rel=""noreferrer noopener"">https://rightsstatements.org/page/InC-NC/1.0/?language=en</a>",,,,,,,,,"Historical Photograph Collection, Special Collections and University Archives",,,,,,,,image/jpg,,,"No language or script-based material",Photographs,08UASOL004,"[image description], Historical Photograph Collection, Special Collections and University Archives, Virginia Tech",,,,,,,,,,,,"Special Collections and University Archives, Virginia Tech",,,,,,,,,,,,,,,,,,,,,,,,,,,,,,,,,,,,,,,,,,,,,,,,,,,,,,,,,,,,,,,,,,,,,,,https://digitalsc.lib.vt.edu/files/original/62daf6038d743aa65dd1cf4594be8d18.jpg,"Still Image","Historical Photograph Collection",1,0
12550,https://digitalsc.lib.vt.edu/items/show/12550,"Interior, wood stove, support posts, and a table in a work area at Solitude",,"Solitude (Blacksburg, Va.: Historic building)^^Blacksburg (Va.)^^Montgomery County (Va.)^^Local/Regional History and Appalachian South^^Virginia Polytechnic Institute and State University^^University History","Color image.",,,,"Historical Photograph Collection, Special Collections and University Archives, Virginia Tech",,,,"1999-03-10 (image scanned) ",,,,,,,,"This Item is protected by copyright and/or related rights. You are free to use this Item in any way that is permitted by the copyright and related rights legislation that applies to your use. In addition, no permission is required from the rights-holder(s) for non-commercial uses. For other uses you need to obtain permission from the rights-holder(s). <a href=""https://rightsstatements.org/page/InC-NC/1.0/?language=en"" target=""_blank"" rel=""noreferrer noopener"">https://rightsstatements.org/page/InC-NC/1.0/?language=en</a>",,,,,,,,,"Historical Photograph Collection, Special Collections and University Archives",,,,,,,,image/jpg,,,"No language or script-based material",Photographs,08UASOL017,"[image description], Historical Photograph Collection, Special Collections and University Archives, Virginia Tech",,,,,,,,,,,,"Special Collections and University Archives, Virginia Tech",,,,,,,,,,,,,,,,,,,,,,,,,,,,,,,,,,,,,,,,,,,,,,,,,,,,,,,,,,,,,,,,,,,,,,,https://digitalsc.lib.vt.edu/files/original/ba5a8834771051aea91610edc0af1883.jpg,"Still Image","Historical Photograph Collection",1,0
12537,https://digitalsc.lib.vt.edu/items/show/12537,"Interior, walls of a room at Solitude during renovation",,"Solitude (Blacksburg, Va.: Historic building)^^Blacksburg (Va.)^^Montgomery County (Va.)^^Local/Regional History and Appalachian South^^Virginia Polytechnic Institute and State University^^University History","Color image.",,,,"Historical Photograph Collection, Special Collections and University Archives, Virginia Tech",,,,"1999-03-10 (image scanned) ",,,,,,,,"This Item is protected by copyright and/or related rights. You are free to use this Item in any way that is permitted by the copyright and related rights legislation that applies to your use. In addition, no permission is required from the rights-holder(s) for non-commercial uses. For other uses you need to obtain permission from the rights-holder(s). <a href=""https://rightsstatements.org/page/InC-NC/1.0/?language=en"" target=""_blank"" rel=""noreferrer noopener"">https://rightsstatements.org/page/InC-NC/1.0/?language=en</a>",,,,,,,,,"Historical Photograph Collection, Special Collections and University Archives",,,,,,,,image/jpg,,,"No language or script-based material",Photographs,08UASOL003,"[image description], Historical Photograph Collection, Special Collections and University Archives, Virginia Tech",,,,,,,,,,,,"Special Collections and University Archives, Virginia Tech",,,,,,,,,,,,,,,,,,,,,,,,,,,,,,,,,,,,,,,,,,,,,,,,,,,,,,,,,,,,,,,,,,,,,,,https://digitalsc.lib.vt.edu/files/original/696efdd8b69ad8afa90d55619b1c3865.jpg,"Still Image","Historical Photograph Collection",1,0
12612,https://digitalsc.lib.vt.edu/items/show/12612,"Interior, walled-off fireplace",,"Solitude (Blacksburg, Va.: Historic building)^^Blacksburg (Va.)^^Montgomery County (Va.)^^Local/Regional History and Appalachian South^^Virginia Polytechnic Institute and State University^^University History","B&W image, see also 03SOL0101.",,,,"Historical Photograph Collection, Special Collections and University Archives, Virginia Tech",,,,,,,,,,,,"This Item is protected by copyright and/or related rights. You are free to use this Item in any way that is permitted by the copyright and related rights legislation that applies to your use. In addition, no permission is required from the rights-holder(s) for non-commercial uses. For other uses you need to obtain permission from the rights-holder(s). <a href=""https://rightsstatements.org/page/InC-NC/1.0/?language=en"" target=""_blank"" rel=""noreferrer noopener"">https://rightsstatements.org/page/InC-NC/1.0/?language=en</a>",,,,,,,,,"Historical Photograph Collection, Special Collections and University Archives",,,,,,,,image/jpg,,,"No language or script-based material",Photographs,SOL0036,"[image description], Historical Photograph Collection, Special Collections and University Archives, Virginia Tech",,,,,,,,,,,,"Special Collections and University Archives, Virginia Tech",,,,,,,,,,,,,,,,,,,,,,,,,,,,,,,,,,,,,,,,,,,,,,,,,,,,,,,,,,,,,,,,,,,,,,,https://digitalsc.lib.vt.edu/files/original/144fb969feca2eab4877e636dca1b1e5.jpg,"Still Image","Historical Photograph Collection",1,0
12543,https://digitalsc.lib.vt.edu/items/show/12543,"Interior, view through a window from inside of Solitude",,"Solitude (Blacksburg, Va.: Historic building)^^Blacksburg (Va.)^^Montgomery County (Va.)^^Local/Regional History and Appalachian South^^Virginia Polytechnic Institute and State University^^University History","Color image.",,,,"Historical Photograph Collection, Special Collections and University Archives, Virginia Tech",,,,"1999-03-10 (image scanned) ",,,,,,,,"This Item is protected by copyright and/or related rights. You are free to use this Item in any way that is permitted by the copyright and related rights legislation that applies to your use. In addition, no permission is required from the rights-holder(s) for non-commercial uses. For other uses you need to obtain permission from the rights-holder(s). <a href=""https://rightsstatements.org/page/InC-NC/1.0/?language=en"" target=""_blank"" rel=""noreferrer noopener"">https://rightsstatements.org/page/InC-NC/1.0/?language=en</a>",,,,,,,,,"Historical Photograph Collection, Special Collections and University Archives",,,,,,,,image/jpg,,,"No language or script-based material",Photographs,08UASOL009,"[image description], Historical Photograph Collection, Special Collections and University Archives, Virginia Tech",,,,,,,,,,,,"Special Collections and University Archives, Virginia Tech",,,,,,,,,,,,,,,,,,,,,,,,,,,,,,,,,,,,,,,,,,,,,,,,,,,,,,,,,,,,,,,,,,,,,,,https://digitalsc.lib.vt.edu/files/original/541bd05aae2f10950b0e5bb09bfad219.jpg,"Still Image","Historical Photograph Collection",1,0
12536,https://digitalsc.lib.vt.edu/items/show/12536,"Interior, view of log house at Solitude",,"Solitude (Blacksburg, Va.: Historic building)^^Blacksburg (Va.)^^Montgomery County (Va.)^^Local/Regional History and Appalachian South^^Virginia Polytechnic Institute and State University^^University History","Color image.",,,,"Historical Photograph Collection, Special Collections and University Archives, Virginia Tech",,,,"1999-03-10 (image scanned) ",,,,,,,,"This Item is protected by copyright and/or related rights. You are free to use this Item in any way that is permitted by the copyright and related rights legislation that applies to your use. In addition, no permission is required from the rights-holder(s) for non-commercial uses. For other uses you need to obtain permission from the rights-holder(s). <a href=""https://rightsstatements.org/page/InC-NC/1.0/?language=en"" target=""_blank"" rel=""noreferrer noopener"">https://rightsstatements.org/page/InC-NC/1.0/?language=en</a>",,,,,,,,,"Historical Photograph Collection, Special Collections and University Archives",,,,,,,,image/jpg,,,"No language or script-based material",Photographs,08UASOL002,"[image description], Historical Photograph Collection, Special Collections and University Archives, Virginia Tech",,,,,,,,,,,,"Special Collections and University Archives, Virginia Tech",,,,,,,,,,,,,,,,,,,,,,,,,,,,,,,,,,,,,,,,,,,,,,,,,,,,,,,,,,,,,,,,,,,,,,,https://digitalsc.lib.vt.edu/files/original/76d796106b9badf39a04608959377a2a.jpg,"Still Image","Historical Photograph Collection",1,0
12539,https://digitalsc.lib.vt.edu/items/show/12539,"Interior, support structure at Solitude during renovation work",,"Solitude (Blacksburg, Va.: Historic building)^^Blacksburg (Va.)^^Montgomery County (Va.)^^Local/Regional History and Appalachian South^^Virginia Polytechnic Institute and State University^^University History","Color image.",,,,"Historical Photograph Collection, Special Collections and University Archives, Virginia Tech",,,,"1999-03-10 (image scanned) ",,,,,,,,"This Item is protected by copyright and/or related rights. You are free to use this Item in any way that is permitted by the copyright and related rights legislation that applies to your use. In addition, no permission is required from the rights-holder(s) for non-commercial uses. For other uses you need to obtain permission from the rights-holder(s). <a href=""https://rightsstatements.org/page/InC-NC/1.0/?language=en"" target=""_blank"" rel=""noreferrer noopener"">https://rightsstatements.org/page/InC-NC/1.0/?language=en</a>",,,,,,,,,"Historical Photograph Collection, Special Collections and University Archives",,,,,,,,image/jpg,,,"No language or script-based material",Photographs,08UASOL005,"[image description], Historical Photograph Collection, Special Collections and University Archives, Virginia Tech",,,,,,,,,,,,"Special Collections and University Archives, Virginia Tech",,,,,,,,,,,,,,,,,,,,,,,,,,,,,,,,,,,,,,,,,,,,,,,,,,,,,,,,,,,,,,,,,,,,,,,https://digitalsc.lib.vt.edu/files/original/2426ef27c41e99c531e0c91180e2935a.jpg,"Still Image","Historical Photograph Collection",1,0
12598,https://digitalsc.lib.vt.edu/items/show/12598,"Interior, Staircase, spinning wheel, and baulastrade, taken from Solitude entryway",,"Solitude (Blacksburg, Va.: Historic building)^^Blacksburg (Va.)^^Montgomery County (Va.)^^Local/Regional History and Appalachian South^^Virginia Polytechnic Institute and State University^^University History","B&W image, see also SOL0004 and 03SOL0098.",,,,"Historical Photograph Collection, Special Collections and University Archives, Virginia Tech",,,,,,,,,,,,"This Item is protected by copyright and/or related rights. You are free to use this Item in any way that is permitted by the copyright and related rights legislation that applies to your use. In addition, no permission is required from the rights-holder(s) for non-commercial uses. For other uses you need to obtain permission from the rights-holder(s). <a href=""https://rightsstatements.org/page/InC-NC/1.0/?language=en"" target=""_blank"" rel=""noreferrer noopener"">https://rightsstatements.org/page/InC-NC/1.0/?language=en</a>",,,,,,,,,"Historical Photograph Collection, Special Collections and University Archives",,,,,,,,image/jpg,,,"No language or script-based material",Photographs,SOL0021,"[image description], Historical Photograph Collection, Special Collections and University Archives, Virginia Tech",,,,,,,,,,,,"Special Collections and University Archives, Virginia Tech",,,,,,,,,,,,,,,,,,,,,,,,,,,,,,,,,,,,,,,,,,,,,,,,,,,,,,,,,,,,,,,,,,,,,,,https://digitalsc.lib.vt.edu/files/original/1893c6ad3b6c99ac314578410c9990a7.jpg,"Still Image","Historical Photograph Collection",1,0
12581,https://digitalsc.lib.vt.edu/items/show/12581,"Interior, staircase, spinning wheel, and baulastrade, taken from Solitude entryway",,"Solitude (Blacksburg, Va.: Historic building)^^Blacksburg (Va.)^^Montgomery County (Va.)^^Local/Regional History and Appalachian South^^Virginia Polytechnic Institute and State University^^University History","Color image, see also SOL0021 and 03SOL0098.",,,,"Historical Photograph Collection, Special Collections and University Archives, Virginia Tech",,,,,,,,,,,,"This Item is protected by copyright and/or related rights. You are free to use this Item in any way that is permitted by the copyright and related rights legislation that applies to your use. In addition, no permission is required from the rights-holder(s) for non-commercial uses. For other uses you need to obtain permission from the rights-holder(s). <a href=""https://rightsstatements.org/page/InC-NC/1.0/?language=en"" target=""_blank"" rel=""noreferrer noopener"">https://rightsstatements.org/page/InC-NC/1.0/?language=en</a>",,,,,,,,,"Historical Photograph Collection, Special Collections and University Archives",,,,,,,,image/jpg,,,"No language or script-based material",Photographs,SOL0004,"[image description], Historical Photograph Collection, Special Collections and University Archives, Virginia Tech",,,,,,,,,,,,"Special Collections and University Archives, Virginia Tech",,,,,,,,,,,,,,,,,,,,,,,,,,,,,,,,,,,,,,,,,,,,,,,,,,,,,,,,,,,,,,,,,,,,,,,https://digitalsc.lib.vt.edu/files/original/e3fc398bd2395e6a53aff4923fdc2a40.jpg,"Still Image","Historical Photograph Collection",1,0
12604,https://digitalsc.lib.vt.edu/items/show/12604,"Interior, staircase in the entryway",,"Solitude (Blacksburg, Va.: Historic building)^^Blacksburg (Va.)^^Montgomery County (Va.)^^Local/Regional History and Appalachian South^^Virginia Polytechnic Institute and State University^^University History","Color image.",,,,"Historical Photograph Collection, Special Collections and University Archives, Virginia Tech",,,,,,,,,,,,"This Item is protected by copyright and/or related rights. You are free to use this Item in any way that is permitted by the copyright and related rights legislation that applies to your use. In addition, no permission is required from the rights-holder(s) for non-commercial uses. For other uses you need to obtain permission from the rights-holder(s). <a href=""https://rightsstatements.org/page/InC-NC/1.0/?language=en"" target=""_blank"" rel=""noreferrer noopener"">https://rightsstatements.org/page/InC-NC/1.0/?language=en</a>",,,,,,,,,"Historical Photograph Collection, Special Collections and University Archives",,,,,,,,image/jpg,,,"No language or script-based material",Photographs,SOL0027,"[image description], Historical Photograph Collection, Special Collections and University Archives, Virginia Tech",,,,,,,,,,,,"Special Collections and University Archives, Virginia Tech",,,,,,,,,,,,,,,,,,,,,,,,,,,,,,,,,,,,,,,,,,,,,,,,,,,,,,,,,,,,,,,,,,,,,,,https://digitalsc.lib.vt.edu/files/original/1ceedc3a46156f45fcba6fc408b33670.jpg,"Still Image","Historical Photograph Collection",1,0