﻿"Item Id","Item URI","Dublin Core:Title","Dublin Core:Alternative Title","Dublin Core:Subject","Dublin Core:Description","Dublin Core:Abstract","Dublin Core:Table Of Contents","Dublin Core:Creator","Dublin Core:Source","Dublin Core:Publisher","Dublin Core:Date","Dublin Core:Date Available","Dublin Core:Date Created","Dublin Core:Date Accepted","Dublin Core:Date Copyrighted","Dublin Core:Date Submitted","Dublin Core:Date Issued","Dublin Core:Date Modified","Dublin Core:Date Valid","Dublin Core:Contributor","Dublin Core:Rights","Dublin Core:Access Rights","Dublin Core:License","Dublin Core:Relation","Dublin Core:Conforms To","Dublin Core:Has Format","Dublin Core:Has Part","Dublin Core:Has Version","Dublin Core:Is Format Of","Dublin Core:Is Part Of","Dublin Core:Is Referenced By","Dublin Core:Is Replaced By","Dublin Core:Is Required By","Dublin Core:Is Version Of","Dublin Core:References","Dublin Core:Replaces","Dublin Core:Requires","Dublin Core:Format","Dublin Core:Extent","Dublin Core:Medium","Dublin Core:Language","Dublin Core:Type","Dublin Core:Identifier","Dublin Core:Bibliographic Citation","Dublin Core:Coverage","Dublin Core:Spatial Coverage","Dublin Core:Temporal Coverage","Dublin Core:Accrual Method","Dublin Core:Accrual Periodicity","Dublin Core:Accrual Policy","Dublin Core:Audience","Dublin Core:Audience Education Level","Dublin Core:Mediator","Dublin Core:Instructional Method","Dublin Core:Provenance","Dublin Core:Rights Holder","Item Type Metadata:Text","Item Type Metadata:Interviewer","Item Type Metadata:Interviewee","Item Type Metadata:Location","Item Type Metadata:Transcription","Item Type Metadata:Local URL","Item Type Metadata:Original Format","Item Type Metadata:Physical Dimensions","Item Type Metadata:Duration","Item Type Metadata:Compression","Item Type Metadata:Producer","Item Type Metadata:Director","Item Type Metadata:Bit Rate/Frequency","Item Type Metadata:Time Summary","Item Type Metadata:Email Body","Item Type Metadata:Subject Line","Item Type Metadata:From","Item Type Metadata:To","Item Type Metadata:CC","Item Type Metadata:BCC","Item Type Metadata:Number of Attachments","Item Type Metadata:Standards","Item Type Metadata:Objectives","Item Type Metadata:Materials","Item Type Metadata:Lesson Plan Text","Item Type Metadata:URL","Item Type Metadata:Event Type","Item Type Metadata:Participants","Item Type Metadata:Birth Date","Item Type Metadata:Birthplace","Item Type Metadata:Death Date","Item Type Metadata:Occupation","Item Type Metadata:Biographical Text","Item Type Metadata:Bibliography","Item Type Metadata:Transcript","Item Type Metadata:Viewer","Item Type Metadata:Narrator","Item Type Metadata:Production Team","Item Type Metadata:Display Resolution","Item Type Metadata:Frame Rate","Item Type Metadata:Player","Omeka Legacy File:Additional Creator","Omeka Legacy File:Transcriber","Omeka Legacy File:Producer","Omeka Legacy File:Render Device","Omeka Legacy File:Render Details","Omeka Legacy File:Capture Date","Omeka Legacy File:Capture Device","Omeka Legacy File:Capture Details","Omeka Legacy File:Change History","Omeka Legacy File:Watermark","Omeka Legacy File:Encryption","Omeka Legacy File:Compression","Omeka Legacy File:Post Processing","Omeka Image File:Width","Omeka Image File:Height","Omeka Image File:Bit Depth","Omeka Image File:Channels","Omeka Image File:Exif String","Omeka Image File:Exif Array","Omeka Image File:IPTC String","Omeka Image File:IPTC Array","Omeka Video File:Bitrate","Omeka Video File:Duration","Omeka Video File:Sample Rate","Omeka Video File:Codec","Omeka Video File:Width","Omeka Video File:Height","PDF Text:Text",tags,file,itemType,collection,public,featured
22208,https://digitalsc.lib.vt.edu/items/show/22208,"A group photograph taken at Lake Springs","A Group Photograph at Lake Springs","Local/Regional History and Appalachian South^^Photographs^^Salem (Va.)","A group photograph taken at Lake Springs",,,"Charlotte D. Gale","<a href=""https://ead.lib.virginia.edu/vivaxtf/view?docId=oai/VT/repositories_2_resources_1778.xml"" target=""_blank"" rel=""noreferrer noopener"">See the finding aid for the Charlotte D. Gale Photograph Album</a>",,"September 1898",,,,,,,,,,"This Item is protected by copyright and/or related rights. You are free to use this Item in any way that is permitted by the copyright and related rights legislation that applies to your use. In addition, no permission is required from the rights-holder(s) for educational uses. For other uses, you need to obtain permission from the rights-holder(s). <a href=""https://rightsstatements.org/page/InC-EDU/1.0/?language=en"" target=""_blank"" rel=""noreferrer noopener"">https://rightsstatements.org/page/InC-EDU/1.0/?language=en</a>",,,,,,,,,Ms1990-044,,,,,,,,,,"Black and White Print","no script-based material",Photographs,Ms1990-044_027b,"Charlotte D. Gale Photograph Album, 1898-1900, Ms1990-044, Special Collections and University Archives, Virginia Tech, Blacksburg, Va.",,,,,,,,,,,,"Special Collections and University Archives, University Libraries, Virginia Tech",,,,,,,,,,,,,,,,,,,,,,,,,,,,,,,,,,,,,,,,,,,,,,,,,,,,,,,,,,,,,,,,,,,,,,,https://digitalsc.lib.vt.edu/files/original/6e5bd38d7af22c6149b5d8421b5ad7df.tif,"Still Image","Charlotte D. Gale Photograph Album (Ms1990-044)",1,0
22212,https://digitalsc.lib.vt.edu/items/show/22212,"Bridge between Roanoke and Salem Virginia","Railroad Bridge between Roanoke and Salem","Local/Regional History and Appalachian South^^Photographs^^Roanoke (Va.)^^Salem (Va.)","Railroad Bridge between Roanoke and Salem, Virginia",,,"Charlotte D. Gale","<a href=""https://ead.lib.virginia.edu/vivaxtf/view?docId=oai/VT/repositories_2_resources_1778.xml"" target=""_blank"" rel=""noreferrer noopener"">See the finding aid for the Charlotte D. Gale Photograph Album</a>",,"September 1898",,,,,,,,,,"This Item is protected by copyright and/or related rights. You are free to use this Item in any way that is permitted by the copyright and related rights legislation that applies to your use. In addition, no permission is required from the rights-holder(s) for educational uses. For other uses, you need to obtain permission from the rights-holder(s). <a href=""https://rightsstatements.org/page/InC-EDU/1.0/?language=en"" target=""_blank"" rel=""noreferrer noopener"">https://rightsstatements.org/page/InC-EDU/1.0/?language=en</a>",,,,,,,,,Ms1990-044,,,,,,,,,,"Black and White Print","no script-based material",Photographs,Ms1990-044_029,"Charlotte D. Gale Photograph Album, 1898-1900, Ms1990-044, Special Collections and University Archives, Virginia Tech, Blacksburg, Va.",,,,,,,,,,,,"Special Collections and University Archives, University Libraries, Virginia Tech",,,,,,,,,,,,,,,,,,,,,,,,,,,,,,,,,,,,,,,,,,,,,,,,,,,,,,,,,,,,,,,,,,,,,,,https://digitalsc.lib.vt.edu/files/original/7a46a73b186c485d7e382b7b74139dc8.tif,"Still Image","Charlotte D. Gale Photograph Album (Ms1990-044)",1,0
22218,https://digitalsc.lib.vt.edu/items/show/22218,"Charlotte Gale Photograph Album",,"Local/Regional History and Appalachian South^^Photographs^^Roanoke (Va.)^^Salem (Va.)","The album contains approximately 40 photos and includes scenes from Crockett Springs, Roanoke, Salem, and Norfolk, Virginia, most featuring identified family and friends. Among the other scenes are photos of the Norfolk & Western office building, Crystal Springs, and a Forepaugh and Sells Brothers Circus parade. The album also contains copies of a few letters, written by previous hit Gale  next hit apparently as practice; a list of personal expenses for the first three months of 1900; and a recipe for photographic developer solution.",,,"Gale, Charlotte D.","<a target=""_blank"" href=""https://ead.lib.virginia.edu/vivaxtf/view?docId=oai/VT/repositories_2_resources_1778.xml&chunk.id=&toc.depth=1&toc.id=&brand=default"">See the finding aid for the Charlotte D. Gale Photograph Album.</a>",,1898-1900,,,,,,,,,,"This Item is protected by copyright and/or related rights. You are free to use this Item in any way that is permitted by the copyright and related rights legislation that applies to your use. In addition, no permission is required from the rights-holder(s) for educational uses. For other uses, you need to obtain permission from the rights-holder(s). <a href=""https://rightsstatements.org/page/InC-EDU/1.0/?language=en"">https://rightsstatements.org/page/InC-EDU/1.0/?language=en</a>",,,,,,,,,Ms1990-044,,,,,,,,,,,English,Scrapbooks,Charlotte_Gale_Photo_Album_Scrapbook,"Researchers wishing to cite this collection should include the following information: [identification of item], [box], [folder], Charlotte D. Gale Photograph Album, Ms1990-044, Special Collections and University Archives, Virginia Tech, Blacksburg, Va.",,,,,,,,,,,,"Special Collections and University Archives, Virginia Tech",,,,,,,,,,,,,,,,,,,,,,,,,,,,,,,,,,,,PDF,,,,,,,,,,,,,,,,,,,,,,,,,,,,,,,,,,,https://digitalsc.lib.vt.edu/files/original/de24a2081a772a121f9f25f11a221665.pdf,Document,"Charlotte D. Gale Photograph Album (Ms1990-044)",1,0
22204,https://digitalsc.lib.vt.edu/items/show/22204,"David McCelung, Grandma, Aunt Mattie and Mother in Rear, Salem, Va.","David McClung in front of a House","Local/Regional History and Appalachian South^^Photographs^^Salem (Va.)","David McCelung, Grandma, Aunt Mattie and Mother in Rear, Salem, Va.",,,"Charlotte D. Gale","<a href=""https://ead.lib.virginia.edu/vivaxtf/view?docId=oai/VT/repositories_2_resources_1778.xml"" target=""_blank"" rel=""noreferrer noopener"">See the finding aid for the Charlotte D. Gale Photograph Album</a>",,"October 6, 1898",,,,,,,,,,"This Item is protected by copyright and/or related rights. You are free to use this Item in any way that is permitted by the copyright and related rights legislation that applies to your use. In addition, no permission is required from the rights-holder(s) for educational uses. For other uses, you need to obtain permission from the rights-holder(s). <a href=""https://rightsstatements.org/page/InC-EDU/1.0/?language=en"" target=""_blank"" rel=""noreferrer noopener"">https://rightsstatements.org/page/InC-EDU/1.0/?language=en</a>",,,,,,,,,Ms1990-044,,,,,,,,,,"Black and White Print","no script-based material",Photographs,Ms1990-044_024a,"Charlotte D. Gale Photograph Album, 1898-1900, Ms1990-044, Special Collections and University Archives, Virginia Tech, Blacksburg, Va.",,,,,,,,,,,,"Special Collections and University Archives, University Libraries, Virginia Tech",,,,,,,,,,,,,,,,,,,,,,,,,,,,,,,,,,,,,,,,,,,,,,,,,,,,,,,,,,,,,,,,,,,,,,,https://digitalsc.lib.vt.edu/files/original/71f14a34d30833d7c6c0636bed153e2e.tif,"Still Image","Charlotte D. Gale Photograph Album (Ms1990-044)",1,0
22202,https://digitalsc.lib.vt.edu/items/show/22202,"David McClung, Salem, Va","A Child on a Bench","Local/Regional History and Appalachian South^^Photographs^^Salem (Va.)","David McClung standing on a bench facing to his right, Salem, Va",,,"Charlotte D. Gale","<a href=""https://ead.lib.virginia.edu/vivaxtf/view?docId=oai/VT/repositories_2_resources_1778.xml"" target=""_blank"" rel=""noreferrer noopener"">See the finding aid for the Charlotte D. Gale Photograph Album</a>",,"October 7, 1898",,,,,,,,,,"This Item is protected by copyright and/or related rights. You are free to use this Item in any way that is permitted by the copyright and related rights legislation that applies to your use. In addition, no permission is required from the rights-holder(s) for educational uses. For other uses, you need to obtain permission from the rights-holder(s). <a href=""https://rightsstatements.org/page/InC-EDU/1.0/?language=en"" target=""_blank"" rel=""noreferrer noopener"">https://rightsstatements.org/page/InC-EDU/1.0/?language=en</a>",,,,,,,,,Ms1990-044,,,,,,,,,,"Black and White Print","no script-based material",Photographs,Ms1990-044_023a,"Charlotte D. Gale Photograph Album, 1898-1900, Ms1990-044, Special Collections and University Archives, Virginia Tech, Blacksburg, Va.",,,,,,,,,,,,"Special Collections and University Archives, University Libraries, Virginia Tech",,,,,,,,,,,,,,,,,,,,,,,,,,,,,,,,,,,,,,,,,,,,,,,,,,,,,,,,,,,,,,,,,,,,,,,https://digitalsc.lib.vt.edu/files/original/04bbd974748c120e73b8743a779b016f.tif,"Still Image","Charlotte D. Gale Photograph Album (Ms1990-044)",1,0
22188,https://digitalsc.lib.vt.edu/items/show/22188,"Family Photo",,"Local/Regional History and Appalachian South^^Photographs^^Roanoke (Va.)^^Salem (Va.)",,,,"Charlotte D. Gale","<a href=""https://ead.lib.virginia.edu/vivaxtf/view?docId=oai/VT/repositories_2_resources_1778.xml"" target=""_blank"" rel=""noreferrer noopener"">See the finding aid for the Charlotte D. Gale Photograph Album</a>",,"September 22, 1898",,,,,,,,,,"This Item is protected by copyright and/or related rights. You are free to use this Item in any way that is permitted by the copyright and related rights legislation that applies to your use. In addition, no permission is required from the rights-holder(s) for educational uses. For other uses, you need to obtain permission from the rights-holder(s). <a href=""https://rightsstatements.org/page/InC-EDU/1.0/?language=en"" target=""_blank"" rel=""noreferrer noopener"">https://rightsstatements.org/page/InC-EDU/1.0/?language=en</a>",,,,,,,,,Ms1990-044,,,,,,,,,,"Black and White Print","no script-based material",Photographs,Ms1990-044_016a,"Charlotte D. Gale Photograph Album, 1898-1900, Ms1990-044, Special Collections and University Archives, Virginia Tech, Blacksburg, Va.",,,,,,,,,,,,"Special Collections and University Archives, University Libraries, Virginia Tech",,,,,,,,,,,,,,,,,,,,,,,,,,,,,,,,,,,,,,,,,,,,,,,,,,,,,,,,,,,,,,,,,,,,,,,https://digitalsc.lib.vt.edu/files/original/cd556947ceca1f50d150ab1e1664c5da.tif,"Still Image","Charlotte D. Gale Photograph Album (Ms1990-044)",1,0
22189,https://digitalsc.lib.vt.edu/items/show/22189,Frances,,"Local/Regional History and Appalachian South^^Photographs^^Roanoke (Va.)^^Salem (Va.)",,,,"Charlotte D. Gale","<a href=""https://ead.lib.virginia.edu/vivaxtf/view?docId=oai/VT/repositories_2_resources_1778.xml"" target=""_blank"" rel=""noreferrer noopener"">See the finding aid for the Charlotte D. Gale Photograph Album</a>",,"September 1898",,,,,,,,,,"This Item is protected by copyright and/or related rights. You are free to use this Item in any way that is permitted by the copyright and related rights legislation that applies to your use. In addition, no permission is required from the rights-holder(s) for educational uses. For other uses, you need to obtain permission from the rights-holder(s). <a href=""https://rightsstatements.org/page/InC-EDU/1.0/?language=en"" target=""_blank"" rel=""noreferrer noopener"">https://rightsstatements.org/page/InC-EDU/1.0/?language=en</a>",,,,,,,,,Ms1990-044,,,,,,,,,,"Black and White Print","no script-based material",Photographs,Ms1990-044_017b,"Charlotte D. Gale Photograph Album, 1898-1900, Ms1990-044, Special Collections and University Archives, Virginia Tech, Blacksburg, Va.",,,,,,,,,,,,"Special Collections and University Archives, University Libraries, Virginia Tech",,,,,,,,,,,,,,,,,,,,,,,,,,,,,,,,,,,,,,,,,,,,,,,,,,,,,,,,,,,,,,,,,,,,,,,https://digitalsc.lib.vt.edu/files/original/8d78288b68b7e1d87550f4804d93fdb1.tif,"Still Image","Charlotte D. Gale Photograph Album (Ms1990-044)",1,0
22201,https://digitalsc.lib.vt.edu/items/show/22201,"Francis and David in wagon, Salem, Va.","Two Children Playing with a Wagon","Local/Regional History and Appalachian South^^Photographs^^Salem (Va.)","Francis and David in wagon, Salem, Va.",,,"Charlotte D. Gale","<a href=""https://ead.lib.virginia.edu/vivaxtf/view?docId=oai/VT/repositories_2_resources_1778.xml"" target=""_blank"" rel=""noreferrer noopener"">See the finding aid for the Charlotte D. Gale Photograph Album</a>",,"October 6, 1898",,,,,,,,,,"This Item is protected by copyright and/or related rights. You are free to use this Item in any way that is permitted by the copyright and related rights legislation that applies to your use. In addition, no permission is required from the rights-holder(s) for educational uses. For other uses, you need to obtain permission from the rights-holder(s). <a href=""https://rightsstatements.org/page/InC-EDU/1.0/?language=en"" target=""_blank"" rel=""noreferrer noopener"">https://rightsstatements.org/page/InC-EDU/1.0/?language=en</a>",,,,,,,,,Ms1990-044,,,,,,,,,,"Black and White Print","no script-based material",Photographs,Ms1990-044_023b,"Charlotte D. Gale Photograph Album, 1898-1900, Ms1990-044, Special Collections and University Archives, Virginia Tech, Blacksburg, Va.",,,,,,,,,,,,"Special Collections and University Archives, University Libraries, Virginia Tech",,,,,,,,,,,,,,,,,,,,,,,,,,,,,,,,,,,,,,,,,,,,,,,,,,,,,,,,,,,,,,,,,,,,,,,https://digitalsc.lib.vt.edu/files/original/fbb04907dcafae84093b6a87fe791fb4.tif,"Still Image","Charlotte D. Gale Photograph Album (Ms1990-044)",1,0
22200,https://digitalsc.lib.vt.edu/items/show/22200,"Francis Kouier and David McClaung looking for bull frogs, Salem, Va.","Two Children Looking for Bull Frogs","Local/Regional History and Appalachian South^^Photographs^^Salem (Va.)","Francis Kouier and David McClaung looking for bull frogs, Salem, Va.",,,"Charlotte D. Gale","<a href=""https://ead.lib.virginia.edu/vivaxtf/view?docId=oai/VT/repositories_2_resources_1778.xml"" target=""_blank"" rel=""noreferrer noopener"">See the finding aid for the Charlotte D. Gale Photograph Album</a>",,"September 24, 1898",,,,,,,,,,"This Item is protected by copyright and/or related rights. You are free to use this Item in any way that is permitted by the copyright and related rights legislation that applies to your use. In addition, no permission is required from the rights-holder(s) for educational uses. For other uses, you need to obtain permission from the rights-holder(s). <a href=""https://rightsstatements.org/page/InC-EDU/1.0/?language=en"" target=""_blank"" rel=""noreferrer noopener"">https://rightsstatements.org/page/InC-EDU/1.0/?language=en</a>",,,,,,,,,Ms1990-044,,,,,,,,,,"Black and White Print","no script-based material",Photographs,Ms1990-044_022a,"Charlotte D. Gale Photograph Album, 1898-1900, Ms1990-044, Special Collections and University Archives, Virginia Tech, Blacksburg, Va.",,,,,,,,,,,,"Special Collections and University Archives, University Libraries, Virginia Tech",,,,,,,,,,,,,,,,,,,,,,,,,,,,,,,,,,,,,,,,,,,,,,,,,,,,,,,,,,,,,,,,,,,,,,,https://digitalsc.lib.vt.edu/files/original/967f14350c5a8ba60d4707a2cbed2e40.tif,"Still Image","Charlotte D. Gale Photograph Album (Ms1990-044)",1,0
22206,https://digitalsc.lib.vt.edu/items/show/22206,"Grandma, Aunt Mattie, Aunt Lizzie, Mother and Lottie, Salem, Va.","Gale Family Photo","Local/Regional History and Appalachian South^^Photographs^^Salem (Va.)","Grandma, Aunt Mattie, Aunt Lizzie, Mother and Lottie, Salem, Va.",,,"Charlotte D. Gale","<a href=""https://ead.lib.virginia.edu/vivaxtf/view?docId=oai/VT/repositories_2_resources_1778.xml"" target=""_blank"" rel=""noreferrer noopener"">See the finding aid for the Charlotte D. Gale Photograph Album</a>",,"October 6, 1898",,,,,,,,,,"This Item is protected by copyright and/or related rights. You are free to use this Item in any way that is permitted by the copyright and related rights legislation that applies to your use. In addition, no permission is required from the rights-holder(s) for educational uses. For other uses, you need to obtain permission from the rights-holder(s). <a href=""https://rightsstatements.org/page/InC-EDU/1.0/?language=en"" target=""_blank"" rel=""noreferrer noopener"">https://rightsstatements.org/page/InC-EDU/1.0/?language=en</a>",,,,,,,,,Ms1990-044,,,,,,,,,,"Black and White Print","no script-based material",Photographs,Ms1990-044_025a,"Charlotte D. Gale Photograph Album, 1898-1900, Ms1990-044, Special Collections and University Archives, Virginia Tech, Blacksburg, Va.",,,,,,,,,,,,"Special Collections and University Archives, University Libraries, Virginia Tech",,,,,,,,,,,,,,,,,,,,,,,,,,,,,,,,,,,,,,,,,,,,,,,,,,,,,,,,,,,,,,,,,,,,,,,https://digitalsc.lib.vt.edu/files/original/1531eba48267457815ea583d40465af4.tif,"Still Image","Charlotte D. Gale Photograph Album (Ms1990-044)",1,0
22197,https://digitalsc.lib.vt.edu/items/show/22197,"Grandma, Aunt Mattie, Lizzie, Francis and David, Salem Va.","A Family Photo","Local/Regional History and Appalachian South^^Photographs^^Salem (Va.)","Grandma, Aunt Mattie, Lizzie, Francis and David, pose on a bench for a photograph in Salem, VA",,,"Charlotte D. Gale","<a href=""https://ead.lib.virginia.edu/vivaxtf/view?docId=oai/VT/repositories_2_resources_1778.xml"" target=""_blank"" rel=""noreferrer noopener"">See the finding aid for the Charlotte D. Gale Photograph Album</a>",,"September 20, 1898",,,,,,,,,,"This Item is protected by copyright and/or related rights. You are free to use this Item in any way that is permitted by the copyright and related rights legislation that applies to your use. In addition, no permission is required from the rights-holder(s) for educational uses. For other uses, you need to obtain permission from the rights-holder(s). <a href=""https://rightsstatements.org/page/InC-EDU/1.0/?language=en"" target=""_blank"" rel=""noreferrer noopener"">https://rightsstatements.org/page/InC-EDU/1.0/?language=en</a>",,,,,,,,,Ms1990-044,,,,,,,,,,"Black and White Print","no script-based material",Photographs,Ms1990-044_021b,"Charlotte D. Gale Photograph Album, 1898-1900, Ms1990-044, Special Collections and University Archives, Virginia Tech, Blacksburg, Va.",,,,,,,,,,,,"Special Collections and University Archives, University Libraries, Virginia Tech",,,,,,,,,,,,,,,,,,,,,,,,,,,,,,,,,,,,,,,,,,,,,,,,,,,,,,,,,,,,,,,,,,,,,,,https://digitalsc.lib.vt.edu/files/original/c99285dd7d72d242aa7cc26e5fdd745a.tif,"Still Image","Charlotte D. Gale Photograph Album (Ms1990-044)",1,0
22203,https://digitalsc.lib.vt.edu/items/show/22203,"Group photograph taken in Salem of Aunt Mattie Buckie, Mother, Grandma, and Aunt Lizzie","A Family Group Photo","Local/Regional History and Appalachian South^^Photographs^^Salem (Va.)","Group photograph of Aunt Mattie Buckie, Mother, Grandma, and Aunt Lizzie, taken in Salem ",,,"Charlotte D. Gale","<a href=""https://ead.lib.virginia.edu/vivaxtf/view?docId=oai/VT/repositories_2_resources_1778.xml"" target=""_blank"" rel=""noreferrer noopener"">See the finding aid for the Charlotte D. Gale Photograph Album</a>",,"October 6, 1898",,,,,,,,,,"This Item is protected by copyright and/or related rights. You are free to use this Item in any way that is permitted by the copyright and related rights legislation that applies to your use. In addition, no permission is required from the rights-holder(s) for educational uses. For other uses, you need to obtain permission from the rights-holder(s). <a href=""https://rightsstatements.org/page/InC-EDU/1.0/?language=en"" target=""_blank"" rel=""noreferrer noopener"">https://rightsstatements.org/page/InC-EDU/1.0/?language=en</a>",,,,,,,,,Ms1990-044,,,,,,,,,,"Black and White Print","no script-based material",Photographs,Ms1990-044_024b,"Charlotte D. Gale Photograph Album, 1898-1900, Ms1990-044, Special Collections and University Archives, Virginia Tech, Blacksburg, Va.",,,,,,,,,,,,"Special Collections and University Archives, University Libraries, Virginia Tech",,,,,,,,,,,,,,,,,,,,,,,,,,,,,,,,,,,,,,,,,,,,,,,,,,,,,,,,,,,,,,,,,,,,,,,https://digitalsc.lib.vt.edu/files/original/098e5ad6b555b8fb88b92a9ac6bf169d.tif,"Still Image","Charlotte D. Gale Photograph Album (Ms1990-044)",1,0
33,https://digitalsc.lib.vt.edu/items/show/33,"Roanoke College, Salem, VA",,"Salem (Va.)^^Local/Regional History and Appalachian South","Bell Chrome Postcard 