﻿"Item Id","Item URI","Dublin Core:Title","Dublin Core:Alternative Title","Dublin Core:Subject","Dublin Core:Description","Dublin Core:Abstract","Dublin Core:Table Of Contents","Dublin Core:Creator","Dublin Core:Source","Dublin Core:Publisher","Dublin Core:Date","Dublin Core:Date Available","Dublin Core:Date Created","Dublin Core:Date Accepted","Dublin Core:Date Copyrighted","Dublin Core:Date Submitted","Dublin Core:Date Issued","Dublin Core:Date Modified","Dublin Core:Date Valid","Dublin Core:Contributor","Dublin Core:Rights","Dublin Core:Access Rights","Dublin Core:License","Dublin Core:Relation","Dublin Core:Conforms To","Dublin Core:Has Format","Dublin Core:Has Part","Dublin Core:Has Version","Dublin Core:Is Format Of","Dublin Core:Is Part Of","Dublin Core:Is Referenced By","Dublin Core:Is Replaced By","Dublin Core:Is Required By","Dublin Core:Is Version Of","Dublin Core:References","Dublin Core:Replaces","Dublin Core:Requires","Dublin Core:Format","Dublin Core:Extent","Dublin Core:Medium","Dublin Core:Language","Dublin Core:Type","Dublin Core:Identifier","Dublin Core:Bibliographic Citation","Dublin Core:Coverage","Dublin Core:Spatial Coverage","Dublin Core:Temporal Coverage","Dublin Core:Accrual Method","Dublin Core:Accrual Periodicity","Dublin Core:Accrual Policy","Dublin Core:Audience","Dublin Core:Audience Education Level","Dublin Core:Mediator","Dublin Core:Instructional Method","Dublin Core:Provenance","Dublin Core:Rights Holder","Item Type Metadata:Text","Item Type Metadata:Interviewer","Item Type Metadata:Interviewee","Item Type Metadata:Location","Item Type Metadata:Transcription","Item Type Metadata:Local URL","Item Type Metadata:Original Format","Item Type Metadata:Physical Dimensions","Item Type Metadata:Duration","Item Type Metadata:Compression","Item Type Metadata:Producer","Item Type Metadata:Director","Item Type Metadata:Bit Rate/Frequency","Item Type Metadata:Time Summary","Item Type Metadata:Email Body","Item Type Metadata:Subject Line","Item Type Metadata:From","Item Type Metadata:To","Item Type Metadata:CC","Item Type Metadata:BCC","Item Type Metadata:Number of Attachments","Item Type Metadata:Standards","Item Type Metadata:Objectives","Item Type Metadata:Materials","Item Type Metadata:Lesson Plan Text","Item Type Metadata:URL","Item Type Metadata:Event Type","Item Type Metadata:Participants","Item Type Metadata:Birth Date","Item Type Metadata:Birthplace","Item Type Metadata:Death Date","Item Type Metadata:Occupation","Item Type Metadata:Biographical Text","Item Type Metadata:Bibliography","Item Type Metadata:Transcript","Item Type Metadata:Viewer","Item Type Metadata:Player","Item Type Metadata:Frame Rate","Item Type Metadata:Display Resolution","Item Type Metadata:Production Team","Item Type Metadata:Narrator","Omeka Legacy File:Additional Creator","Omeka Legacy File:Transcriber","Omeka Legacy File:Producer","Omeka Legacy File:Render Device","Omeka Legacy File:Render Details","Omeka Legacy File:Capture Date","Omeka Legacy File:Capture Device","Omeka Legacy File:Capture Details","Omeka Legacy File:Change History","Omeka Legacy File:Watermark","Omeka Legacy File:Encryption","Omeka Legacy File:Compression","Omeka Legacy File:Post Processing","Omeka Image File:Width","Omeka Image File:Height","Omeka Image File:Bit Depth","Omeka Image File:Channels","Omeka Image File:Exif String","Omeka Image File:Exif Array","Omeka Image File:IPTC String","Omeka Image File:IPTC Array","Omeka Video File:Bitrate","Omeka Video File:Duration","Omeka Video File:Sample Rate","Omeka Video File:Codec","Omeka Video File:Width","Omeka Video File:Height","PDF Text:Text",tags,file,itemType,collection,public,featured
3644,https://digitalsc.lib.vt.edu/items/show/3644,"Community '89 advertisement for ""Homosexuality and the Bible"" on October 28, 1989",,"Sexual minorities^^University History",,,,,,"The Collegiate Times",1989-10-27,,,,,,,,,,,,,,,,,,,,,,,,,,,,,,,Articles,CT_Vol86_No20_1989_1027_pgA2b,,,,,,,,,,,,,,,,,,,,,,,,,,,,,,,,,,,,,,,,,,,,,,,,,PDF,,,,,,,,,,,,,,,,,,,,,,,,,,,,,,,,,,,https://digitalsc.lib.vt.edu/files/original/3644/CT_Vol86_No20_1989_1027_pgA2b.pdf,Document,"Collegiate Times LGBTQ Articles",1,0
3623,https://digitalsc.lib.vt.edu/items/show/3623,"Commentary, Population Control, response to 'Committing What is Shameful' letter on October 23, 1990",,"Sexual minorities^^University History",,,,,,"The Collegiate Times",1990-10-30,,,,,,,,,,,,,,,,,,,,,,,,,,,,,,,Articles,CT_Vol87_No19_1990_1030_pgA4a,,,,,,,,,,,,,,,,,,,,,,,,,,,,,,,,,,,,,,,,,,,,,,,,,PDF,,,,,,,,,,,,,,,,,,,,,,,,,,,,,,,,,,,https://digitalsc.lib.vt.edu/files/original/3623/CT_Vol87_No19_1990_1030_pgA4a.pdf,Document,"Collegiate Times LGBTQ Articles",1,0
3604,https://digitalsc.lib.vt.edu/items/show/3604,"Commentary, Burning Door No Prank, response to the burning of gay student Michael Fritz's dorm room door",,"Sexual minorities^^University History",,,,,,"The Collegiate Times",1991-10-08,,,,,,,,,,,,,,,,,,,,,,,,,,,,,,,Articles,CT_Vol88_No13_1991_1008_pgA10a,,,,,,,,,,,,,,,,,,,,,,,,,,,,,,,,,,,,,,,,,,,,,,,,,PDF,,,,,,,,,,,,,,,,,,,,,,,,,,,,,,,,,,,https://digitalsc.lib.vt.edu/files/original/3604/CT_Vol88_No13_1991_1008_pgA10a.pdf,Document,"Collegiate Times LGBTQ Articles",1,0
3752,https://digitalsc.lib.vt.edu/items/show/3752,"Commentary on Winter Foilage, a gay play showing on campus",,"Sexual minorities^^University History",,,,,,"The Collegiate Times",1975-11-07,,,,,,,,,,,,,,,,,,,,,,,,,,,,,,,Articles,CT_Vol72_No12_1975_1107_pg4,,,,,,,,,,,,,,,,,,,,,,,,,,,,,,,,,,,,,,,,,,,,,,,,,PDF,,,,,,,,,,,,,,,,,,,,,,,,,,,,,,,,,,,https://digitalsc.lib.vt.edu/files/original/3752/CT_Vol72_No12_1975_1107_pg4.pdf,Document,"Collegiate Times LGBTQ Articles",1,0
3599,https://digitalsc.lib.vt.edu/items/show/3599,"Coming Out Day Comes to Virginia Tech",,"Sexual minorities^^University History",,,,,,"The Collegiate Times",1991-10-15,,,,,,,,,,,,,,,,,,,,,,,,,,,,,,,Articles,CT_Vol88_No15_1991_1015,,,,,,,,,,,,,,,,,,,,,,,,,,,,,,,,,,,,,,,,,,,,,,,,,PDF,,,,,,,,,,,,,,,,,,,,,,,,,,,,,,,,,,,https://digitalsc.lib.vt.edu/files/original/3599/CT_Vol88_No15_1991_1015.1.pdf,Document,"Collegiate Times LGBTQ Articles",1,0
3645,https://digitalsc.lib.vt.edu/items/show/3645,"Collection Donated for AIDS Memorial",,"Sexual minorities^^University History",,,,,,"The Collegiate Times",1989-10-27,,,,,,,,,,,,,,,,,,,,,,,,,,,,,,,Articles,CT_Vol86_No20_1989_1027,,,,,,,,,,,,,,,,,,,,,,,,,,,,,,,,,,,,,,,,,,,,,,,,,PDF,,,,,,,,,,,,,,,,,,,,,,,,,,,,,,,,,,,https://digitalsc.lib.vt.edu/files/original/3645/CT_Vol86_No20_1989_1027.pdf,Document,"Collegiate Times LGBTQ Articles",1,0
3756,https://digitalsc.lib.vt.edu/items/show/3756,"Clisham Clarifies Sexual Charges",,"Sexual minorities^^University History",,,,,,"The Collegiate Times",1975-03-05,,,,,,,,,,,,,,,,,,,,,,,,,,,,,,,Articles,CT_Vol71_No18_1975_0305_pg1,,,,,,,,,,,,,,,,,,,,,,,,,,,,,,,,,,,,,,,,,,,,,,,,,PDF,,,,,,,,,,,,,,,,,,,,,,,,,,,,,,,,,,,https://digitalsc.lib.vt.edu/files/original/3756/CT_Vol71_No18_1975_0305_pg1.pdf,Document,"Collegiate Times LGBTQ Articles",1,0
3684,https://digitalsc.lib.vt.edu/items/show/3684,"Church Mistaken About Gays",,"Sexual minorities^^University History",,,,,,"The Collegiate Times",1985-02-26,,,,,,,,,,,,,,,,,,,,,,,,,,,,,,,Articles,CT_Vol81_No35_1985_0219_pgA4b,,,,,,,,,,,,,,,,,,,,,,,,,,,,,,,,,,,,,,,,,,,,,,,,,PDF,,,,,,,,,,,,,,,,,,,,,,,,,,,,,,,,,,,https://digitalsc.lib.vt.edu/files/original/3684/CT_Vol81_No35_1985_0219_pgA4b.pdf,Document,"Collegiate Times LGBTQ Articles",1,0
3749,https://digitalsc.lib.vt.edu/items/show/3749,"Church Allows Gays to Stay in Cooper",,"Sexual minorities^^University History",,,,,,"The Collegiate Times",1976-02-17,,,,,,,,,,,,,,,,,,,,,,,,,,,,,,,Articles,CT_Vol72_No31_1976_0217_pg1,,,,,,,,,,,,,,,,,,,,,,,,,,,,,,,,,,,,,,,,,,,,,,,,,PDF,,,,,,,,,,,,,,,,,,,,,,,,,,,,,,,,,,,https://digitalsc.lib.vt.edu/files/original/3749/CT_Vol72_No31_1976_0217_pg1.pdf,Document,"Collegiate Times LGBTQ Articles",1,0
3672,https://digitalsc.lib.vt.edu/items/show/3672,"Campus Organizations Plan AIDS Forum",,"Sexual minorities^^University History",,,,,,"The Collegiate Times",1986-02-29,,,,,,,,,,,,,,,,,,,,,,,,,,,,,,,Articles,CT_Vol82_No36_1986_0229a,,,,,,,,,,,,,,,,,,,,,,,,,,,,,,,,,,,,,,,,,,,,,,,,,PDF,,,,,,,,,,,,,,,,,,,,,,,,,,,,,,,,,,,https://digitalsc.lib.vt.edu/files/original/3672/CT_Vol82_No36_1986_0229a.pdf,Document,"Collegiate Times LGBTQ Articles",1,0
3290,https://digitalsc.lib.vt.edu/items/show/3290,"Budget Requests, Lambda Horizon, January 1986 (Ms2014-010)",,"Lambda Horizon. (LGBTA of Virginia Tech)^^Weber, Mark A.^^University Archives^^Sexual minorities^^University History^^Virginia Polytechnic Institute and State University","Lambda Horizon request for a small grant to help fund an AIDS Education Forum.",,,"Lambda Horizon. (LGBTA of Virginia Tech)^^Weber, Mark A.","<a href=""http://ead.lib.virginia.edu/vivaxtf/view?docId=vt/viblbv00016.xml"" target=""_blank"">See the Finding Aid for the Mark A. Weber Papers</a>",,1986-01,,,,,,,,,,"<a href=""https://digitalsc.lib.vt.edu/files/thumbnails/spec_forms/PubPermission.doc"" target=""_blank"">Permission to publish material from the Mark A. Weber Papers must be obtained from Special Collections, Virginia Tech.</a>",,,,,,,,,"Box 1, Folder 7",,,,,,,,,,,English,"Administrative records",Ms2014-010_WeberMark_BudgetRequests_1986_01,"Researchers wishing to cite this collection should include the following information: Mark A. Weber Papers, Ms2014-010, Special Collections, Virginia Tech, Blacksburg, Va.",,,,,,,,,,,,"<a href=""http://spec.lib.vt.edu/"" target=""_blank"">Special Collections, University Libraries, Virginia Tech</a>",,,,,,,,,,,,,,,,,,,,,,,,,,,,,,,,,,,,,,,,,,,,,,,,,,,,,,,,,,,,,,,,,,,,,,,"https://digitalsc.lib.vt.edu/files/original/3290/Ms2014-010_WeberMark_BudgetRequests_1986_01a.jpg,https://digitalsc.lib.vt.edu/files/original/3290/Ms2014-010_WeberMark_BudgetRequests_1986_01b.jpg,https://digitalsc.lib.vt.edu/files/original/3290/Ms2014-010_WeberMark_BudgetRequests_1986_01c.jpg",Document,"Mark A. Weber Papers (Ms2014-010)",1,0
3291,https://digitalsc.lib.vt.edu/items/show/3291,"Budget Request, Lambda Horizon, October 1986 (Ms2014-010)",,"Lambda Horizon. (LGBTA of Virginia Tech)^^Weber, Mark A.^^Sexual minorities^^University Archives^^Virginia Polytechnic Institute and State University^^University History","A Lambda Horizon request to the Student Budget Board for funds to move and maintain a phone line for the organization.",,,"Lambda Horizon. (LGBTA of Virginia Tech)^^Weber, Mark A.","<a href=""http://ead.lib.virginia.edu/vivaxtf/view?docId=vt/viblbv00016.xml"" target=""_blank"">See the Finding Aid for the Mark A. Weber Papers</a>",,1986-10,,,,,,,,,,"<a href=""https://digitalsc.lib.vt.edu/files/thumbnails/spec_forms/PubPermission.doc"" target=""_blank"">Permission to publish material from the Mark A. Weber Papers must be obtained from Special Collections, Virginia Tech.</a>",,,,,,,,,"Box 1, Folder 7",,,,,,,,,,,English,"Administrative records",Ms2014-010_WeberMark_BudgetRequests_1986_10,"Researchers wishing to cite this collection should include the following information: Mark A. Weber Papers, Ms2014-010, Special Collections, Virginia Tech, Blacksburg, Va.",,,,,,,,,,,,"<a href=""http://spec.lib.vt.edu/"" target=""_blank"">Special Collections, University Libraries, Virginia Tech</a>",,,,,,,,,,,,,,,,,,,,,,,,,,,,,,,,,,,,,,,,,,,,,,,,,,,,,,,,,,,,,,,,,,,,,,,"https://digitalsc.lib.vt.edu/files/original/3291/Ms2014-010_WeberMark_BudgetRequests_1986_10a.jpg,https://digitalsc.lib.vt.edu/files/original/3291/Ms2014-010_WeberMark_BudgetRequests_1986_10b.jpg",Document,"Mark A. Weber Papers (Ms2014-010)",1,0
3292,https://digitalsc.lib.vt.edu/items/show/3292,"Budget Request, Lambda Horizon, March 1987 (Ms2014-010)",,"Lambda Horizon. (LGBTA of Virginia Tech)^^Weber, Mark A.^^University History^^Virginia Polytechnic Institute and State University^^Sexual minorities","A Lambda Horizon request to the Student Budget Board for a small grant to help fund the 3rd Annual Gay Awareness Week.",,,"Lambda Horizon. (LGBTA of Virginia Tech)^^Weber, Mark A.","<a href=""http://ead.lib.virginia.edu/vivaxtf/view?docId=vt/viblbv00016.xml"" target=""_blank"">See the Finding Aid for the Mark A. Weber Papers</a>",,1987-03,,,,,,,,,,"<a href=""https://digitalsc.lib.vt.edu/files/thumbnails/spec_forms/PubPermission.doc"" target=""_blank"">Permission to publish material from the Mark A. Weber Papers must be obtained from Special Collections, Virginia Tech.</a>",,,,,,,,,"Box 1, Folder 7",,,,,,,,,,,English,"Administrative records",Ms2014-010_WeberMark_BudgetRequests_1987_03,"Researchers wishing to cite this collection should include the following information: Mark A. Weber Papers, Ms2014-010, Special Collections, Virginia Tech, Blacksburg, Va.",,,,,,,,,,,,"<a href=""http://spec.lib.vt.edu/"" target=""_blank"">Special Collections, University Libraries, Virginia Tech</a>",,,,,,,,,,,,,,,,,,,,,,,,,,,,,,,,,,,,,,,,,,,,,,,,,,,,,,,,,,,,,,,,,,,,,,,"https://digitalsc.lib.vt.edu/files/original/3292/Ms2014-010_WeberMark_BudgetRequests_1987_03a.jpg,https://digitalsc.lib.vt.edu/files/original/3292/Ms2014-010_WeberMark_BudgetRequests_1987_03b.jpg",Document,"Mark A. Weber Papers (Ms2014-010)",1,0
4053,https://digitalsc.lib.vt.edu/items/show/4053,"BOV Reverses Controversial Decisions","Virginia Tech's highest governing body has voted to rescind its earlier actions that eliminated affirmative action and removed sexual orientation from its anti-discrimination policy","Sexual minorities^^University History",,,,,,"The Collegiate Times",2003-04-08,,,,,,,,,,,,,,,,,,,,,,,,,,,,,,,Articles,CT_Vol100_No102_2003_0408_2,,,,,,,,,,,,,,,,,,,,,,,,,,,,,,,,,,,,,,,,,,,,,,,,,PDF,,,,,,,,,,,,,,,,,,,,,,,,,,,,,,,,,,,https://digitalsc.lib.vt.edu/files/original/4053/CT_Vol100_No102_2003_0408_2.pdf,Document,"Collegiate Times LGBTQ Articles",1,0
4052,https://digitalsc.lib.vt.edu/items/show/4052,"BOV Protests Continue",,"Sexual minorities^^University History",,,,,,"The Collegiate Times",2003-04-08,,,,,,,,,,,,,,,,,,,,,,,,,,,,,,,Articles,CT_Vol100_No102_2003_0408_1,,,,,,,,,,,,,,,,,,,,,,,,,,,,,,,,,,,,,,,,,,,,,,,,,PDF,,,,,,,,,,,,,,,,,,,,,,,,,,,,,,,,,,,https://digitalsc.lib.vt.edu/files/original/4052/CT_Vol100_No102_2003_0408_1.pdf,Document,"Collegiate Times LGBTQ Articles",1,0
3685,https://digitalsc.lib.vt.edu/items/show/3685,"Articles Sidestep the Truth",,"Sexual minorities^^University History",,,,,,"The Collegiate Times",1985-02-19,,,,,,,,,,,,,,,,,,,,,,,,,,,,,,,Articles,CT_Vol81_No35_1985_0219_pgA4a,,,,,,,,,,,,,,,,,,,,,,,,,,,,,,,,,,,,,,,,,,,,,,,,,PDF,,,,,,,,,,,,,,,,,,,,,,,,,,,,,,,,,,,https://digitalsc.lib.vt.edu/files/original/3685/CT_Vol81_No35_1985_0219_pgA4a.pdf,Document,"Collegiate Times LGBTQ Articles",1,0
3632,https://digitalsc.lib.vt.edu/items/show/3632,"Another Step for Gay Rights",,"Sexual minorities^^University History",,,,,,"The Collegiate Times",1990-10-05,,,,,,,,,,,,,,,,,,,,,,,,,,,,,,,Articles,CT_Vol87_No12_1990_1005_pgA4,,,,,,,,,,,,,,,,,,,,,,,,,,,,,,,,,,,,,,,,,,,,,,,,,PDF,,,,,,,,,,,,,,,,,,,,,,,,,,,,,,,,,,,https://digitalsc.lib.vt.edu/files/original/3632/CT_Vol87_No12_1990_1005_pgA4.pdf,Document,"Collegiate Times LGBTQ Articles",1,0
3658,https://digitalsc.lib.vt.edu/items/show/3658,"Alumnus with AIDS Discusses Disease",,"Sexual minorities^^University History",,,,,,"The Collegiate Times",1989-03-24,,,,,,,,,,,,,,,,,,,,,,,,,,,,,,,Articles,CT_Vol85_No49_1989_0324,,,,,,,,,,,,,,,,,,,,,,,,,,,,,,,,,,,,,,,,,,,,,,,,,PDF,,,,,,,,,,,,,,,,,,,,,,,,,,,,,,,,,,,https://digitalsc.lib.vt.edu/files/original/3658/CT_Vol85_No49_1989_0324.pdf,Document,"Collegiate Times LGBTQ Articles",1,0
3613,https://digitalsc.lib.vt.edu/items/show/3613,"AIDS' Discoverer, Experts to Speak at Tech",,"Sexual minorities^^University History",,,,,,"The Collegiate Times",1991-03-19,,,,,,,,,,,,,,,,,,,,,,,,,,,,,,,Articles,CT_Vol87_No48_1991_0319_pgA2,,,,,,,,,,,,,,,,,,,,,,,,,,,,,,,,,,,,,,,,,,,,,,,,,PDF,,,,,,,,,,,,,,,,,,,,,,,,,,,,,,,,,,,https://digitalsc.lib.vt.edu/files/original/3613/CT_Vol87_No48_1991_0319_pgA2.pdf,Document,"Collegiate Times LGBTQ Articles",1,0
3607,https://digitalsc.lib.vt.edu/items/show/3607,"AIDS Quilt Encourages Tribute, Memorial, Hope",,"Sexual minorities^^University History",,,,,,"The Collegiate Times",1991-04-02,,,,,,,,,,,,,,,,,,,,,,,,,,,,,,,Articles,CT_Vol87_No52_1991_0402,,,,,,,,,,,,,,,,,,,,,,,,,,,,,,,,,,,,,,,,,,,,,,,,,PDF,,,,,,,,,,,,,,,,,,,,,,,,,,,,,,,,,,,https://digitalsc.lib.vt.edu/files/original/3607/CT_Vol87_No52_1991_0402.pdf,Document,"Collegiate Times LGBTQ Articles",1,0
3687,https://digitalsc.lib.vt.edu/items/show/3687,"AIDS Not Reported at Tech",,"Sexual minorities^^University History",,,,"Edwards, Gregory Allen",,"The Collegiate Times",1985-02-08,,,,,,,,,,,,,,,,,,,,,,,,,,,,,,,Articles,CT_Vol81_No32_1985_0208,,,,,,,,,,,,,,,,,,,,,,,,,,,,,,,,,,,,,,,,,,,,,,,,,PDF,,,,,,,,,,,,,,,,,,,,,,,,,,,,,,,,,,,https://digitalsc.lib.vt.edu/files/original/3687/CT_Vol81_No32_1985_0208.pdf,Document,"Collegiate Times LGBTQ Articles",1,0
3654,https://digitalsc.lib.vt.edu/items/show/3654,"AIDS not Gender-specific",,"Sexual minorities^^University History",,,,,,"The Collegiate Times",1989-04-11,,,,,,,,,,,,,,,,,,,,,,,,,,,,,,,Articles,CT_Vol85_No54_1989_0411_pgB2,,,,,,,,,,,,,,,,,,,,,,,,,,,,,,,,,,,,,,,,,,,,,,,,,PDF,,,,,,,,,,,,,,,,,,,,,,,,,,,,,,,,,,,https://digitalsc.lib.vt.edu/files/original/3654/CT_Vol85_No54_1989_0411_pgB2.pdf,Document,"Collegiate Times LGBTQ Articles",1,0
3611,https://digitalsc.lib.vt.edu/items/show/3611,"AIDS Hits Close to Home",,"Sexual minorities^^University History",,,,,,"The Collegiate Times",1991-03-22,,,,,,,,,,,,,,,,,,,,,,,,,,,,,,,Articles,CT_Vol87_No49_1991_0322_pgA10,,,,,,,,,,,,,,,,,,,,,,,,,,,,,,,,,,,,,,,,,,,,,,,,,PDF,,,,,,,,,,,,,,,,,,,,,,,,,,,,,,,,,,,https://digitalsc.lib.vt.edu/files/original/3611/CT_Vol87_No49_1991_0322_pgA10.pdf,Document,"Collegiate Times LGBTQ Articles",1,0
3383,https://digitalsc.lib.vt.edu/items/show/3383,"AIDS Education Objectives, January 9, 1986 (Ms2014-010)",,"Lambda Horizon. (LGBTA of Virginia Tech)^^Weber, Mark A.^^University History^^Virginia Polytechnic Institute and State University^^Sexual minorities","AIDS Education Committee objectives, composed to help obtain support and endorsement for the AIDS Education effort at Virginia Tech.",,,"Lambda Horizon. (LGBTA of Virginia Tech)^^Weber, Mark A.","<a href=""http://ead.lib.virginia.edu/vivaxtf/view?docId=vt/viblbv00016.xml"" target=""_blank"">See the Finding Aid for the&nbsp;Mark A. Weber Papers</a>",,1986-01-09,,,,,,,,,,"<a href=""https://digitalsc.lib.vt.edu/files/thumbnails/spec_forms/PubPermission.doc"" target=""_blank"">Permission to publish material from the Mark A. Weber Papers&nbsp;must be obtained from Special Collections, Virginia Tech.</a>",,,,,,,,,"Box 1, Folder 15",,,,,,,,,,,English,,Ms2014-010_WeberMark_ObjectivesAIDSEducation_1986_0109,"Researchers wishing to cite this collection should include the following information: Mark A. Weber Papers, Ms2014-010, Special Collections, Virginia Tech, Blacksburg, Va.",,,,,,,,,,,,"<a href=""http://spec.lib.vt.edu/"" target=""_blank"">Special Collections, University Libraries, Virginia Tech</a>",,,,,,,,,,,,,,,,,,,,,,,,,,,,,,,,,,,,,,,,,,,,,,,,,,,,,,,,,,,,,,,,,,,,,,,https://digitalsc.lib.vt.edu/files/original/3383/Ms2014-010_WeberMark_ObjectivesAIDSEducation_1986_0109.jpg,Document,"Mark A. Weber Papers (Ms2014-010)",1,0
3293,https://digitalsc.lib.vt.edu/items/show/3293,"AIDS Education Forum Chronology, October 23, 1985 - March 2, 1986 (Ms2014-010)",,"Lambda Horizon. (LGBTA of Virginia Tech)^^Weber, Mark A.^^University History^^Virginia Polytechnic Institute and State University^^Sexual minorities","Chronology of events leading up to the AIDS Education Forum held at Virginia Tech on March 1, 1986.",,,"Weber, Mark A.^^Lambda Horizon. (LGBTA of Virginia Tech)","<a href=""http://ead.lib.virginia.edu/vivaxtf/view?docId=vt/viblbv00016.xml"" target=""_blank"">See the Finding Aid for the Mark A. Weber Papers</a>",,1985-10-23/1986-03-02,,,,,,,,,,"<a href=""https://digitalsc.lib.vt.edu/files/thumbnails/spec_forms/PubPermission.doc"" target=""_blank"">Permission to publish material from the Mark A. Weber Papers must be obtained from Special Collections, Virginia Tech.</a>",,,,,,,,,"Box 1, Folder 16",,,,,,,,,,,English,"Administrative records",Ms2014-010_WeberMark_ChronologyAIDSEducation_1985_1023-1986_0302,"Researchers wishing to cite this collection should include the following information: Mark A. Weber Papers, Ms2014-010, Special Collections, Virginia Tech, Blacksburg, Va.",,,,,,,,,,,,"<a href=""http://spec.lib.vt.edu/"" target=""_blank"">Special Collections, University Libraries, Virginia Tech</a>",,,,,,,,,,,,,,,,,,,,,,,,,,,,,,,,,,,,,,,,,,,,,,,,,,,,,,,,,,,,,,,,,,,,,,,"https://digitalsc.lib.vt.edu/files/original/3293/Ms2014-010_WeberMark_ChronologyAIDSEducation_1985_1023-1986_0302a.jpg,https://digitalsc.lib.vt.edu/files/original/3293/Ms2014-010_WeberMark_ChronologyAIDSEducation_1985_1023-1986_0302b.jpg,https://digitalsc.lib.vt.edu/files/original/3293/Ms2014-010_WeberMark_ChronologyAIDSEducation_1985_1023-1986_0302c.jpg,https://digitalsc.lib.vt.edu/files/original/3293/Ms2014-010_WeberMark_ChronologyAIDSEducation_1985_1023-1986_0302d.jpg,https://digitalsc.lib.vt.edu/files/original/3293/Ms2014-010_WeberMark_ChronologyAIDSEducation_1985_1023-1986_0302e.jpg,https://digitalsc.lib.vt.edu/files/original/3293/Ms2014-010_WeberMark_ChronologyAIDSEducation_1985_1023-1986_0302f.jpg,https://digitalsc.lib.vt.edu/files/original/3293/Ms2014-010_WeberMark_ChronologyAIDSEducation_1985_1023-1986_0302g.jpg,https://digitalsc.lib.vt.edu/files/original/3293/Ms2014-010_WeberMark_ChronologyAIDSEducation_1985_1023-1986_0302h.jpg,https://digitalsc.lib.vt.edu/files/original/3293/Ms2014-010_WeberMark_ChronologyAIDSEducation_1985_1023-1986_0302i.jpg",Document,"Mark A. Weber Papers (Ms2014-010)",1,0
3673,https://digitalsc.lib.vt.edu/items/show/3673,"AIDS Committee to Educate Students About Fatal Disease",,"Sexual minorities^^University History",,,,,,"The Collegiate Times",1985-11-19,,,,,,,,,,,,,,,,,,,,,,,,,,,,,,,Articles,CT_Vol82_No16_1985_1119,,,,,,,,,,,,,,,,,,,,,,,,,,,,,,,,,,,,,,,,,,,,,,,,,PDF,,,,,,,,,,,,,,,,,,,,,,,,,,,,,,,,,,,https://digitalsc.lib.vt.edu/files/original/3673/CT_Vol82_No16_1985_1119.pdf,Document,"Collegiate Times LGBTQ Articles",1,0
3631,https://digitalsc.lib.vt.edu/items/show/3631,"AIDS Awareness, Underwood Article",,"Sexual minorities^^University History",,,,,,"The Collegiate Times",1990-10-09,,,,,,,,,,,,,,,,,,,,,,,,,,,,,,,Articles,CT_Vol87_No13_1990_1009_pgA8,,,,,,,,,,,,,,,,,,,,,,,,,,,,,,,,,,,,,,,,,,,,,,,,,PDF,,,,,,,,,,,,,,,,,,,,,,,,,,,,,,,,,,,https://digitalsc.lib.vt.edu/files/original/3631/CT_Vol87_No13_1990_1009_pgA8.pdf,Document,"Collegiate Times LGBTQ Articles",1,0