﻿"Item Id","Item URI","Dublin Core:Title","Dublin Core:Alternative Title","Dublin Core:Subject","Dublin Core:Description","Dublin Core:Abstract","Dublin Core:Table Of Contents","Dublin Core:Creator","Dublin Core:Source","Dublin Core:Publisher","Dublin Core:Date","Dublin Core:Date Available","Dublin Core:Date Created","Dublin Core:Date Accepted","Dublin Core:Date Copyrighted","Dublin Core:Date Submitted","Dublin Core:Date Issued","Dublin Core:Date Modified","Dublin Core:Date Valid","Dublin Core:Contributor","Dublin Core:Rights","Dublin Core:Access Rights","Dublin Core:License","Dublin Core:Relation","Dublin Core:Conforms To","Dublin Core:Has Format","Dublin Core:Has Part","Dublin Core:Has Version","Dublin Core:Is Format Of","Dublin Core:Is Part Of","Dublin Core:Is Referenced By","Dublin Core:Is Replaced By","Dublin Core:Is Required By","Dublin Core:Is Version Of","Dublin Core:References","Dublin Core:Replaces","Dublin Core:Requires","Dublin Core:Format","Dublin Core:Extent","Dublin Core:Medium","Dublin Core:Language","Dublin Core:Type","Dublin Core:Identifier","Dublin Core:Bibliographic Citation","Dublin Core:Coverage","Dublin Core:Spatial Coverage","Dublin Core:Temporal Coverage","Dublin Core:Accrual Method","Dublin Core:Accrual Periodicity","Dublin Core:Accrual Policy","Dublin Core:Audience","Dublin Core:Audience Education Level","Dublin Core:Mediator","Dublin Core:Instructional Method","Dublin Core:Provenance","Dublin Core:Rights Holder","Item Type Metadata:Text","Item Type Metadata:Interviewer","Item Type Metadata:Interviewee","Item Type Metadata:Location","Item Type Metadata:Transcription","Item Type Metadata:Local URL","Item Type Metadata:Original Format","Item Type Metadata:Physical Dimensions","Item Type Metadata:Duration","Item Type Metadata:Compression","Item Type Metadata:Producer","Item Type Metadata:Director","Item Type Metadata:Bit Rate/Frequency","Item Type Metadata:Time Summary","Item Type Metadata:Email Body","Item Type Metadata:Subject Line","Item Type Metadata:From","Item Type Metadata:To","Item Type Metadata:CC","Item Type Metadata:BCC","Item Type Metadata:Number of Attachments","Item Type Metadata:Standards","Item Type Metadata:Objectives","Item Type Metadata:Materials","Item Type Metadata:Lesson Plan Text","Item Type Metadata:URL","Item Type Metadata:Event Type","Item Type Metadata:Participants","Item Type Metadata:Birth Date","Item Type Metadata:Birthplace","Item Type Metadata:Death Date","Item Type Metadata:Occupation","Item Type Metadata:Biographical Text","Item Type Metadata:Bibliography","Item Type Metadata:Transcript","Item Type Metadata:Viewer","Item Type Metadata:Player","Item Type Metadata:Frame Rate","Item Type Metadata:Display Resolution","Item Type Metadata:Production Team","Item Type Metadata:Narrator","Omeka Legacy File:Additional Creator","Omeka Legacy File:Transcriber","Omeka Legacy File:Producer","Omeka Legacy File:Render Device","Omeka Legacy File:Render Details","Omeka Legacy File:Capture Date","Omeka Legacy File:Capture Device","Omeka Legacy File:Capture Details","Omeka Legacy File:Change History","Omeka Legacy File:Watermark","Omeka Legacy File:Encryption","Omeka Legacy File:Compression","Omeka Legacy File:Post Processing","Omeka Image File:Width","Omeka Image File:Height","Omeka Image File:Bit Depth","Omeka Image File:Channels","Omeka Image File:Exif String","Omeka Image File:Exif Array","Omeka Image File:IPTC String","Omeka Image File:IPTC Array","Omeka Video File:Bitrate","Omeka Video File:Duration","Omeka Video File:Sample Rate","Omeka Video File:Codec","Omeka Video File:Width","Omeka Video File:Height","PDF Text:Text",tags,file,itemType,collection,public,featured
11294,https://digitalsc.lib.vt.edu/items/show/11294,"Baptist Church Collection Ledger, 1931 (Ms1989-039)",,"Local/Regional History and Appalachian South^^Textile workers^^Baptists","A page from a mill ledger recording employee contributions to the Baptist Church in Fries, which they could have deducted from their paychecks.",,,"Washington Mills Company","<a href=""https://ead.lib.virginia.edu/vivaxtf/view?docId=vt/viblbv00590.xml"">See the Finding Aid for the Fries Textile Plant Records</a> ",,1931,,,,,,,,,,"<a href=""https://omeka.lib.vt.edu/files/thumbnails/spec_forms/PubPermission.doc"">Permission to publish material from the Fries Textile Plant Records Collection must be obtained from Special Collections, Virginia Tech.</a>",,,,,,,,,,,,,,,,,,,,,"Administrative records",Ms1989-039_B031_607,"Researchers wishing to cite this collection should include the following information: Fries Textile Plant Records, Ms1989-039, Special Collections, Virginia Polytechnic Institute and State University, Blacksburg, Va.",,,,,,,,,,,,"<a href=""http://spec.lib.vt.edu/"" target=""_blank"" rel=""noreferrer noopener"">Special Collections, University Libraries, Virginia Tech</a>",,,,,,,,,,,,,,,,,,,,,,,,,,,,,,,,,,,,,,,,,,,,,,,,,,,,,,,,,,,,,,,,,,,,,,,https://digitalsc.lib.vt.edu/files/original/6034defac88798bcee0686e9190fc7c3.jpg,Document,"Fries Textile Plant Records, 1900-1988 (Ms1989-039)",1,0
11293,https://digitalsc.lib.vt.edu/items/show/11293,"Baptist Church Collection Ledger, 1924 (Ms1989-039)",,"Local/Regional History and Appalachian South^^Textile workers^^Baptists","A page from a mill ledger recording employee contributions to the Baptist Church in Fries, which they could have deducted from their paychecks.",,,"Washington Mills Company","<a href=""https://ead.lib.virginia.edu/vivaxtf/view?docId=vt/viblbv00590.xml"">See the Finding Aid for the Fries Textile Plant Records</a> ",,1924,,,,,,,,,,"<a href=""https://omeka.lib.vt.edu/files/thumbnails/spec_forms/PubPermission.doc"">Permission to publish material from the Fries Textile Plant Records Collection must be obtained from Special Collections, Virginia Tech.</a>",,,,,,,,,,,,,,,,,,,,,"Administrative records",Ms1989-039_B031_606,"Researchers wishing to cite this collection should include the following information: Fries Textile Plant Records, Ms1989-039, Special Collections, Virginia Polytechnic Institute and State University, Blacksburg, Va.",,,,,,,,,,,,"<a href=""http://spec.lib.vt.edu/"" target=""_blank"" rel=""noreferrer noopener"">Special Collections, University Libraries, Virginia Tech</a>",,,,,,,,,,,,,,,,,,,,,,,,,,,,,,,,,,,,,,,,,,,,,,,,,,,,,,,,,,,,,,,,,,,,,,,https://digitalsc.lib.vt.edu/files/original/ffe000bc2813bb3cd48a40110ec8059e.jpg,Document,"Fries Textile Plant Records, 1900-1988 (Ms1989-039)",1,0
11288,https://digitalsc.lib.vt.edu/items/show/11288,"Time Book, 1909 (Ms1989-039)",,"Local/Regional History and Appalachian South^^Textile workers^^Personnel records","Two facing pages from a mill ledger recording the hours worked by individual employees.",,,"Washington Mills Company","<a href=""https://ead.lib.virginia.edu/vivaxtf/view?docId=vt/viblbv00590.xml"">See the Finding Aid for the Fries Textile Plant Records</a> ",,1909-04,,,,,,,,,,"<a href=""https://omeka.lib.vt.edu/files/thumbnails/spec_forms/PubPermission.doc"">Permission to publish material from the Fries Textile Plant Records Collection must be obtained from Special Collections, Virginia Tech.</a>",,,,,,,,,,,,,,,,,,,,,"Administrative records",Ms1989-039_B031_601,"Researchers wishing to cite this collection should include the following information: Fries Textile Plant Records, Ms1989-039, Special Collections, Virginia Polytechnic Institute and State University, Blacksburg, Va.",,,,,,,,,,,,"<a href=""http://spec.lib.vt.edu/"" target=""_blank"" rel=""noreferrer noopener"">Special Collections, University Libraries, Virginia Tech</a>",,,,,,,,,,,,,,,,,,,,,,,,,,,,,,,,,,,,,,,,,,,,,,,,,,,,,,,,,,,,,,,,,,,,,,,https://digitalsc.lib.vt.edu/files/original/d2fbe79c1733f071c9dbe15be263cf46.jpg,Document,"Fries Textile Plant Records, 1900-1988 (Ms1989-039)",1,0
11287,https://digitalsc.lib.vt.edu/items/show/11287,"Employee Family Records (Ms1989-039)",,"Local/Regional History and Appalachian South^^Textile workers^^Personnel records","Two facing pages from a mill ledger recording early mill employees and their families.",,,"Washington Mills Company","<a href=""https://ead.lib.virginia.edu/vivaxtf/view?docId=vt/viblbv00590.xml"">See the Finding Aid for the Fries Textile Plant Records</a> ",,N.D.,,,,,,,,,,"<a href=""https://omeka.lib.vt.edu/files/thumbnails/spec_forms/PubPermission.doc"">Permission to publish material from the Fries Textile Plant Records Collection must be obtained from Special Collections, Virginia Tech.</a>",,,,,,,,,,,,,,,,,,,,,"Administrative records",Ms1989-039_B031_600,"Researchers wishing to cite this collection should include the following information: Fries Textile Plant Records, Ms1989-039, Special Collections, Virginia Polytechnic Institute and State University, Blacksburg, Va.",,,,,,,,,,,,"<a href=""http://spec.lib.vt.edu/"" target=""_blank"" rel=""noreferrer noopener"">Special Collections, University Libraries, Virginia Tech</a>",,,,,,,,,,,,,,,,,,,,,,,,,,,,,,,,,,,,,,,,,,,,,,,,,,,,,,,,,,,,,,,,,,,,,,,https://digitalsc.lib.vt.edu/files/original/e5ca10ae5486e6dac28dd61b61b5ec0f.jpg,Document,"Fries Textile Plant Records, 1900-1988 (Ms1989-039)",1,0
11286,https://digitalsc.lib.vt.edu/items/show/11286,"Housing Maintenance Records, 1936-1946 (Ms1989-039)",,"Local/Regional History and Appalachian South^^Textile industry^^Company towns^^Maintenance","A page from a mill ledger tracking maintenance work done on the mill-owned houses in Fries, Va.",,,"Washington Mills Company","<a href=""https://ead.lib.virginia.edu/vivaxtf/view?docId=vt/viblbv00590.xml"">See the Finding Aid for the Fries Textile Plant Records</a> ",,1936-1946,,,,,,,,,,"<a href=""https://omeka.lib.vt.edu/files/thumbnails/spec_forms/PubPermission.doc"">Permission to publish material from the Fries Textile Plant Records Collection must be obtained from Special Collections, Virginia Tech.</a>",,,,,,,,,,,,,,,,,,,,,"Administrative records",Ms1989-039_B031_599,"Researchers wishing to cite this collection should include the following information: Fries Textile Plant Records, Ms1989-039, Special Collections, Virginia Polytechnic Institute and State University, Blacksburg, Va.",,,,,,,,,,,,"<a href=""http://spec.lib.vt.edu/"" target=""_blank"" rel=""noreferrer noopener"">Special Collections, University Libraries, Virginia Tech</a>",,,,,,,,,,,,,,,,,,,,,,,,,,,,,,,,,,,,,,,,,,,,,,,,,,,,,,,,,,,,,,,,,,,,,,,https://digitalsc.lib.vt.edu/files/original/eaea19dc3f30b52e6b378d53c4887db6.jpg,Document,"Fries Textile Plant Records, 1900-1988 (Ms1989-039)",1,0
11147,https://digitalsc.lib.vt.edu/items/show/11147,"Memo to Cease Knitting Operations at the Mill, 1973 (Ms1989-039)",,"Local/Regional History and Appalachian South^^Textile workers^^Textile industry","A memo sent to all departments notifying them that the Fries Mill would shut down knitting operations.",,,"Robinson, James E. Jr.","<a href=""https://ead.lib.virginia.edu/vivaxtf/view?docId=vt/viblbv00590.xml"">See the Finding Aid for the Fries Textile Plant Records</a> ",,1973-03-30,,,,,,,,,,"<a href=""https://omeka.lib.vt.edu/files/thumbnails/spec_forms/PubPermission.doc"">Permission to publish material from the Fries Textile Plant Records Collection must be obtained from Special Collections, Virginia Tech.</a>",,,,,,,,,,,,,,,,,,,,,"Administrative records",Ms1989-039_054_122_001,"Researchers wishing to cite this collection should include the following information: Fries Textile Plant Records, Ms1989-039, Special Collections, Virginia Polytechnic Institute and State University, Blacksburg, Va.",,,,,,,,,,,,"<a href=""http://spec.lib.vt.edu/"" target=""_blank"" rel=""noreferrer noopener"">Special Collections, University Libraries, Virginia Tech</a>",,,,,,,,,,,,,,,,,,,,,,,,,,,,,,,,,,,,,,,,,,,,,,,,,,,,,,,,,,,,,,,,,,,,,,,https://digitalsc.lib.vt.edu/files/original/f1a8b53fbbb82472ef9df7cda6f9c19c.jpg,Document,"Fries Textile Plant Records, 1900-1988 (Ms1989-039)",1,0
10216,https://digitalsc.lib.vt.edu/items/show/10216,"Proposal to Establish a Pride Resource Center at Virginia Tech",,"LGBTQ+ History^^University History",,,,"LGBT Caucus at Virginia Tech",,,2015-03-31,,,,,,,,,,,,,,,,,,,,,,,,,,,,,,,"Administrative records",RG08_16_Proposal_to_Establish_2015_03_31,,,,,,,,,,,,,,,,,,,,,,,,,,,,,,,,,,,,,,,,,,,,,,,,,PDF,,,,,,,,,,,,,,,,,,,,,,,,,,,,,,,,,,,https://digitalsc.lib.vt.edu/files/original/e395ee9c27197ad571d2d8f358efc1b8.pdf,Document,"LGBTQ History at Virginia Tech",1,0
5536,https://digitalsc.lib.vt.edu/items/show/5536,"Administrative Records, ""PRDA"", n.d. (Ms1989-029)",,"Science and Technology^^Archives of American Aerospace Exploration (AAAE)^^Astronauts^^Project Gemini (U.S.)^^United States. National Aeronautics and Space Administration","Page listing the rules for a PRDA related submission process.",,,"Collins, Michael, 1930-","<a href=""http://search.vaheritage.org/vivaxtf/view?docId=vt/viblbv00092.xml"" target=""_blank"">See the Finding Aid for the Michael Collins Papers</a>",,1985,,,,,,,,,,"<a href=""https://digitalsc.lib.vt.edu/files/thumbnails/spec_forms/PubPermission.doc"" target=""_blank"">Permission to publish material from the Michael Collins Papers must be obtained from Special Collections, Virginia Tech.</a>",,,,,,,,,"Ms1989-029, Box 19, Folder 2",,,,,,,,,,,,"Administrative Records",Ms1989-029_B19_F2_Administrative_1985_ND,"Researchers wishing to cite this collection should include the following information: Michael Collins Papers, Ms1989-029, Special Collections, Virginia Polytechnic Institute and State University, Blacksburg, Va.",,,,,,,,,,,,"<a href=""http://spec.lib.vt.edu/"" target=""_blank"">Special Collections, University Libraries, Virginia Tech</a>",,,,,,,,,,,,,,,,,,,,,,,,,,,,,,,,,,,,,,,,,,,,,,,,,,,,,,,,,,,,,,,,,,,,,,,http://spec.lib.vt.edu/pickup/Omeka_upload/Ms1989-029_B19_F2_Administrative_1985_ND.jpg,Document,"The Michael Collins Papers (Ms1989-029)",1,0
5535,https://digitalsc.lib.vt.edu/items/show/5535,"Administrative Records, ""Human Factors Engineering in Research, Development and Acquisition"", October 31, 1980 (Ms1989-029)",,"Science and Technology^^Archives of American Aerospace Exploration (AAAE)^^Astronauts^^Project Gemini (U.S.)^^United States. National Aeronautics and Space Administration","Management Model for ""Human Factors Engineering in Research, Development and Acquisitions"". From the Department of the Army.",,,"Collins, Michael, 1930-","<a href=""http://search.vaheritage.org/vivaxtf/view?docId=vt/viblbv00092.xml"" target=""_blank"">See the Finding Aid for the Michael Collins Papers</a>",,1980-10-31,,,,,,,,,,"<a href=""https://digitalsc.lib.vt.edu/files/thumbnails/spec_forms/PubPermission.doc"" target=""_blank"">Permission to publish material from the Michael Collins Papers must be obtained from Special Collections, Virginia Tech.</a>",,,,,,,,,"Ms1989-029, Box 19, Folder 2",,,,,,,,,,,,"Administrative Records",Ms1989-029_B19_F2_Administrative_1980_1031,"Researchers wishing to cite this collection should include the following information: Michael Collins Papers, Ms1989-029, Special Collections, Virginia Polytechnic Institute and State University, Blacksburg, Va.",,,,,,,,,,,,"<a href=""http://spec.lib.vt.edu/"" target=""_blank"">Special Collections, University Libraries, Virginia Tech</a>",,,,,,,,,,,,,,,,,,,,,,,,,,,,,,,,,,,,,,,,,,,,,,,,,,,,,,,,,,,,,,,,,,,,,,,"http://spec.lib.vt.edu/pickup/Omeka_upload/Ms1989-029_B19_F2_Administrative_1980_1031a.jpg,http://spec.lib.vt.edu/pickup/Omeka_upload/Ms1989-029_B19_F2_Administrative_1980_1031b.jpg",Document,"The Michael Collins Papers (Ms1989-029)",1,0
5481,https://digitalsc.lib.vt.edu/items/show/5481,"Administrative Records, ""CPRW Inc."" 1985-1986 (Ms1989-029)",,"Science and Technology^^Archives of American Aerospace Exploration (AAAE)^^Astronauts^^Project Gemini (U.S.)^^United States. National Aeronautics and Space Administration","Miscellaneous administrative records and ephemera from CPRW Inc.",,,"Collins, Michael, 1930-","<a href=""http://search.vaheritage.org/vivaxtf/view?docId=vt/viblbv00092.xml"" target=""_blank"">See the Finding Aid for the Michael Collins Papers</a>",,1985-10-23,,,,,,,,,,"<a href=""https://digitalsc.lib.vt.edu/files/thumbnails/spec_forms/PubPermission.doc"" target=""_blank"">Permission to publish material from the Michael Collins Papers must be obtained from Special Collections, Virginia Tech.</a>",,,,,,,,,"Ms1989-029, Box 19, Folder 3a",,,,,,,,,,,,"Administrative Records",Ms1989-029_MichaelCollins_B19_F3a_Administrative_1985_1023_Complete,"Researchers wishing to cite this collection should include the following information: Michael Collins Papers, Ms1989-029, Special Collections, Virginia Polytechnic Institute and State University, Blacksburg, Va.",,,,,,,,,,,,"<a href=""http://spec.lib.vt.edu/"" target=""_blank"">Special Collections, University Libraries, Virginia Tech</a>",,,,,,,,,,,,,,,,,,,,,,,,,,,,,,,,,,,,PDF,,,,,,,,,,,,,,,,,,,,,,,,,,,,,,,,,,,http://spec.lib.vt.edu/pickup/Omeka_upload/Ms1989-029_MichaelCollins_B19_F3a_Administrative_1985_1023_Complete.pdf,Document,"The Michael Collins Papers (Ms1989-029)",1,0
5374,https://digitalsc.lib.vt.edu/items/show/5374,"Itinerary, ""Itinerary of Mr. & Mrs. Collins: Fiji Islands & Texas"", Oct. 5-18, 1970 (Ms1989-029)",,"Science and Technology^^Archives of American Aerospace Exploration (AAAE)^^Astronauts^^Project Gemini (U.S.)^^United States. National Aeronautics and Space Administration","The Travel Itinerary of Michael Collins and his wife for their trip to Fiji and Texas.",,,"Collins, Michael, 1930-","<a href=""http://search.vaheritage.org/vivaxtf/view?docId=vt/viblbv00092.xml"" target=""_blank"">See the Finding Aid for the Michael Collins Papers</a>",,1970-10-05,,,,,,,,,,"<a href=""https://digitalsc.lib.vt.edu/files/thumbnails/spec_forms/PubPermission.doc"" target=""_blank"">Permission to publish material from the Michael Collins Papers must be obtained from Special Collections, Virginia Tech.</a>",,,,,,,,,"Ms1989-029, Box 18, Folder 1",,,,,,,,,,,,"Administrative Records",Ms1989-029_B18_F1_MichaelCollins_Itinerary_1970_1005,"Researchers wishing to cite this collection should include the following information: Michael Collins Papers, Ms1989-029, Special Collections, Virginia Polytechnic Institute and State University, Blacksburg, Va.",,,,,,,,,,,,"<a href=""http://spec.lib.vt.edu/"" target=""_blank"">Special Collections, University Libraries, Virginia Tech</a>",,,,,,,,,,,,,,,,,,,,,,,,,,,,,,,,,,,,,,,,,,,,,,,,,,,,,,,,,,,,,,,,,,,,,,,"http://spec.lib.vt.edu/pickup/Omeka_upload/Ms1989-029_B18_F1_MichaelCollins_Itinerary_1970_1005a.jpg,http://spec.lib.vt.edu/pickup/Omeka_upload/Ms1989-029_B18_F1_MichaelCollins_Itinerary_1970_1005b.jpg,http://spec.lib.vt.edu/pickup/Omeka_upload/Ms1989-029_B18_F1_MichaelCollins_Itinerary_1970_1005c.jpg",Document,"The Michael Collins Papers (Ms1989-029)",1,0
4632,https://digitalsc.lib.vt.edu/items/show/4632,"Elizabeth Hughes Claim for Damages, 1868 (Ms2009-048)",,"Civil War^^Women","Elizabeth Hughes claim for damages done to her home by unidentified Confederate forces in 1862. The claim is dated 1868, and details the loss of property stolen and destroyed by fire.",,,,"<a href=""http://ead.lib.virginia.edu/vivaxtf/view?docId=vt/viblbv00383.xml"" target=""_blank"">See the finding aid for the Elizabeth Hughes Claim for Damanges, 1868.</a>",,1868-05-20,,,,,,,,,,"<a href=""https://digitalsc.lib.vt.edu/files/thumbnails/spec_forms/PubPermission.doc"" target=""_blank"">Permission to publish material from the Elizabeth Hughes Claim for Damages, 1868 must be obtained from Special Collections, Virginia Tech.</a>",,,,,,,,,,"For more information on this item, see ""<a href=""https://vtspecialcollections.wordpress.com/2013/03/19/elizabeth-hughes-claim/"" target=""_blank"">Claiming What&rsquo;s Hers: Repayment under Reconstruction</a>"" on the ""In Special Collections @Virginia Tech"" blog.",,,,,,,,,,,"Administrative records",Ms2009-048,"Researchers wishing to cite this collection should include the following information: Elizabeth Hughes Claim for Damages, 1868, Ms2009-048 - Special Collections, Virginia Tech, Blacksburg, Va.",,,,,,,,,,,,"Special Collections, Virginia Tech",,,,,,,,,,,,,,,,,,,,,,,,,,,,,,,,,,,,,,,,,,,,,,,,,,,,,,,,,,,,,,,,,,,,,,,"https://digitalsc.lib.vt.edu/files/original/4632/Ms2009_048_001.jpg,https://digitalsc.lib.vt.edu/files/original/4632/Ms2009_048_002.jpg,https://digitalsc.lib.vt.edu/files/original/4632/Ms2009_048_003.jpg,https://digitalsc.lib.vt.edu/files/original/4632/Ms2009_048_004.jpg","Still Image","The American Civil War",1,0
4147,https://digitalsc.lib.vt.edu/items/show/4147,"List of Odd Fellows Members and Semi Annual Dues, 1917 (Ms1988-009)",,"Blacksburg (Va.)^^Local/Regional History and Appalachian South^^African American history^^Montgomery County (Va.)","Handwritten list of names and dues paid at Tadmore Light Lodge #6184, Blacksburg Va.",,,"Grand United Order of Odd Fellows in America, Tadmore Light Lodge #6184","<a href=""http://ead.lib.virginia.edu/vivaead/published/vt/viblbv00006.xml.frame"" target=""_blank"">See the Finding Aid for the Blacksburg Virginia Odd Fellows Records</a>",,1917,,,,,,,,,,"This Item is protected by copyright and/or related rights. You are free to use this Item in any way that is permitted by the copyright and related rights legislation that applies to your use. In addition, no permission is required from the rights-holder(s) for educational uses. For other uses, you need to obtain permission from the rights-holder(s). <a href=""https://rightsstatements.org/page/InC-EDU/1.0/?language=en"" target=""_blank"">https://rightsstatements.org/page/InC-EDU/1.0/?language=en</a>",,,,,,,,,,,,,,,,,application/pdf,"1 page",,English,"Administrative records",Ms1988_009_B01_F27,"Blacksburg [Virginia] Odd Fellows Records, 1902-1969, Ms1988-009, Special Collections, University Libraries, Virginia Polytechnic Institute and State University.",,,,,,,,,,,,"<a href=""http://spec.lib.vt.edu/"" target=""_blank"">Special Collections, University Libraries, Virginia Tech</a>",,,,,,,,,,,,,,,,,,,,,,,,,,,,,,,,,,,,,,,,,,,,,,,,,,,,,,,,,,,,,,,,,,,,,,,https://digitalsc.lib.vt.edu/files/original/4147/Ms1988-009_OddFellows_B1F27_DuesBook_pg02.jpg,Document,"Blacksburg [Virginia] Odd Fellows Records, 1902-1969 (Ms1988-009)",1,0