﻿"Item Id","Item URI","Dublin Core:Title","Dublin Core:Alternative Title","Dublin Core:Subject","Dublin Core:Description","Dublin Core:Abstract","Dublin Core:Table Of Contents","Dublin Core:Creator","Dublin Core:Source","Dublin Core:Publisher","Dublin Core:Date","Dublin Core:Date Available","Dublin Core:Date Created","Dublin Core:Date Accepted","Dublin Core:Date Copyrighted","Dublin Core:Date Submitted","Dublin Core:Date Issued","Dublin Core:Date Modified","Dublin Core:Date Valid","Dublin Core:Contributor","Dublin Core:Rights","Dublin Core:Access Rights","Dublin Core:License","Dublin Core:Relation","Dublin Core:Conforms To","Dublin Core:Has Format","Dublin Core:Has Part","Dublin Core:Has Version","Dublin Core:Is Format Of","Dublin Core:Is Part Of","Dublin Core:Is Referenced By","Dublin Core:Is Replaced By","Dublin Core:Is Required By","Dublin Core:Is Version Of","Dublin Core:References","Dublin Core:Replaces","Dublin Core:Requires","Dublin Core:Format","Dublin Core:Extent","Dublin Core:Medium","Dublin Core:Language","Dublin Core:Type","Dublin Core:Identifier","Dublin Core:Bibliographic Citation","Dublin Core:Coverage","Dublin Core:Spatial Coverage","Dublin Core:Temporal Coverage","Dublin Core:Accrual Method","Dublin Core:Accrual Periodicity","Dublin Core:Accrual Policy","Dublin Core:Audience","Dublin Core:Audience Education Level","Dublin Core:Mediator","Dublin Core:Instructional Method","Dublin Core:Provenance","Dublin Core:Rights Holder","Item Type Metadata:Text","Item Type Metadata:Interviewer","Item Type Metadata:Interviewee","Item Type Metadata:Location","Item Type Metadata:Transcription","Item Type Metadata:Local URL","Item Type Metadata:Original Format","Item Type Metadata:Physical Dimensions","Item Type Metadata:Duration","Item Type Metadata:Compression","Item Type Metadata:Producer","Item Type Metadata:Director","Item Type Metadata:Bit Rate/Frequency","Item Type Metadata:Time Summary","Item Type Metadata:Email Body","Item Type Metadata:Subject Line","Item Type Metadata:From","Item Type Metadata:To","Item Type Metadata:CC","Item Type Metadata:BCC","Item Type Metadata:Number of Attachments","Item Type Metadata:Standards","Item Type Metadata:Objectives","Item Type Metadata:Materials","Item Type Metadata:Lesson Plan Text","Item Type Metadata:URL","Item Type Metadata:Event Type","Item Type Metadata:Participants","Item Type Metadata:Birth Date","Item Type Metadata:Birthplace","Item Type Metadata:Death Date","Item Type Metadata:Occupation","Item Type Metadata:Biographical Text","Item Type Metadata:Bibliography","Item Type Metadata:Transcript","Item Type Metadata:Viewer","Item Type Metadata:Player","Item Type Metadata:Frame Rate","Item Type Metadata:Display Resolution","Item Type Metadata:Production Team","Item Type Metadata:Narrator","Omeka Legacy File:Additional Creator","Omeka Legacy File:Transcriber","Omeka Legacy File:Producer","Omeka Legacy File:Render Device","Omeka Legacy File:Render Details","Omeka Legacy File:Capture Date","Omeka Legacy File:Capture Device","Omeka Legacy File:Capture Details","Omeka Legacy File:Change History","Omeka Legacy File:Watermark","Omeka Legacy File:Encryption","Omeka Legacy File:Compression","Omeka Legacy File:Post Processing","Omeka Image File:Width","Omeka Image File:Height","Omeka Image File:Bit Depth","Omeka Image File:Channels","Omeka Image File:Exif String","Omeka Image File:Exif Array","Omeka Image File:IPTC String","Omeka Image File:IPTC Array","Omeka Video File:Bitrate","Omeka Video File:Duration","Omeka Video File:Sample Rate","Omeka Video File:Codec","Omeka Video File:Width","Omeka Video File:Height","PDF Text:Text",tags,file,itemType,collection,public,featured
5368,https://digitalsc.lib.vt.edu/items/show/5368,"Clippings, ""NASA Current News"", Michael Collins, Aug 8, 1969 (Ms1989-029)",,"Science and Technology^^Archives of American Aerospace Exploration (AAAE)^^Astronauts^^Project Gemini (U.S.)^^United States. National Aeronautics and Space Administration","NASA-collected newsclippings from Aug 7, 1969 regarding their various activities.",,,"Collins, Michael, 1930-","<a href=""http://search.vaheritage.org/vivaxtf/view?docId=vt/viblbv00092.xml"" target=""_blank"">See the Finding Aid for the Michael Collins Papers</a>",,1969-08-08,,,,,,,,,,"<a href=""https://digitalsc.lib.vt.edu/files/thumbnails/spec_forms/PubPermission.doc"" target=""_blank"">Permission to publish material from the Michael Collins Papers must be obtained from Special Collections, Virginia Tech.</a>",,,,,,,,,"Ms1989-029, Box 14, Folder 2",,,,,,,,,,,,Clippings,Ms1989-029_B14_F2,"Researchers wishing to cite this collection should include the following information: Michael Collins Papers, Ms1989-029, Special Collections, Virginia Polytechnic Institute and State University, Blacksburg, Va.",,,,,,,,,,,,"<a href=""http://spec.lib.vt.edu/"" target=""_blank"">Special Collections, University Libraries, Virginia Tech</a>",,,,,,,,,,,,,,,,,,,,,,,,,,,,,,,,,,,,PDF,,,,,,,,,,,,,,,,,,,,,,,,,,,,,,,,,,,http://spec.lib.vt.edu/pickup/Omeka_upload/Ms1989-029_B14_F2.pdf,Document,"The Michael Collins Papers (Ms1989-029)",1,0
5369,https://digitalsc.lib.vt.edu/items/show/5369,"Clippings, ""NASA Current News Apollo 11 Special Issue"", Michael Collins, Jul-Aug, 1969 [1 of 2] (Ms1989-029)",,"Science and Technology^^Archives of American Aerospace Exploration (AAAE)^^Astronauts^^Project Gemini (U.S.)^^United States. National Aeronautics and Space Administration","Part 1 of 2 of NASA-collected newsclippings from Aug 7, 1969 specifically regarding the Apollo 2 mission.",,,"Collins, Michael, 1930-","<a href=""http://search.vaheritage.org/vivaxtf/view?docId=vt/viblbv00092.xml"" target=""_blank"">See the Finding Aid for the Michael Collins Papers</a>",,1969-07/1969-08,,,,,,,,,,"<a href=""https://digitalsc.lib.vt.edu/files/thumbnails/spec_forms/PubPermission.doc"" target=""_blank"">Permission to publish material from the Michael Collins Papers must be obtained from Special Collections, Virginia Tech.</a>",,,,,,,,,"Ms1989-029, Box 14, Folder 3a",,,,,,,,,,,,Clippings,Ms1989-029_B14_F3a,"Researchers wishing to cite this collection should include the following information: Michael Collins Papers, Ms1989-029, Special Collections, Virginia Polytechnic Institute and State University, Blacksburg, Va.",,,,,,,,,,,,"<a href=""http://spec.lib.vt.edu/"" target=""_blank"">Special Collections, University Libraries, Virginia Tech</a>",,,,,,,,,,,,,,,,,,,,,,,,,,,,,,,,,,,,PDF,,,,,,,,,,,,,,,,,,,,,,,,,,,,,,,,,,,http://spec.lib.vt.edu/pickup/Omeka_upload/Ms1989-029_B14_F3a.pdf,Document,"The Michael Collins Papers (Ms1989-029)",1,0
5370,https://digitalsc.lib.vt.edu/items/show/5370,"Clippings, ""NASA Current News Apollo 11 Special Issue"", Michael Collins, Jul-Aug, 1969 [2 of 2] (Ms1989-029)",,"Science and Technology^^Archives of American Aerospace Exploration (AAAE)^^Astronauts^^Project Gemini (U.S.)^^United States. National Aeronautics and Space Administration","Part 2 of 2 of NASA-collected newsclippings from Aug 7, 1969 specifically regarding the Apollo 2 mission.",,,"Collins, Michael, 1930-","<a href=""http://search.vaheritage.org/vivaxtf/view?docId=vt/viblbv00092.xml"" target=""_blank"">See the Finding Aid for the Michael Collins Papers</a>",,1969-07/1969-08,,,,,,,,,,"<a href=""https://digitalsc.lib.vt.edu/files/thumbnails/spec_forms/PubPermission.doc"" target=""_blank"">Permission to publish material from the Michael Collins Papers must be obtained from Special Collections, Virginia Tech.</a>",,,,,,,,,"Ms1989-029, Box 14, Folder 3b",,,,,,,,,,,,Clippings,Ms1989-029_B14_F3b,"Researchers wishing to cite this collection should include the following information: Michael Collins Papers, Ms1989-029, Special Collections, Virginia Polytechnic Institute and State University, Blacksburg, Va.",,,,,,,,,,,,"<a href=""http://spec.lib.vt.edu/"" target=""_blank"">Special Collections, University Libraries, Virginia Tech</a>",,,,,,,,,,,,,,,,,,,,,,,,,,,,,,,,,,,,PDF,,,,,,,,,,,,,,,,,,,,,,,,,,,,,,,,,,,http://spec.lib.vt.edu/pickup/Omeka_upload/Ms1989-029_B14_F3b.pdf,Document,"The Michael Collins Papers (Ms1989-029)",1,0
5390,https://digitalsc.lib.vt.edu/items/show/5390,"Clippings, ""State Department Astronaut"", 1969-1971 (Ms1989)",,"Science and Technology^^Archives of American Aerospace Exploration (AAAE)^^Astronauts^^Project Gemini (U.S.)^^United States. National Aeronautics and Space Administration","Collection of Newspaper Clippings pertaining to Michael Collins' tenure at the State Department.",,,"Collins, Michael, 1930-","<a href=""http://search.vaheritage.org/vivaxtf/view?docId=vt/viblbv00092.xml"" target=""_blank"">See the Finding Aid for the Michael Collins Papers</a>",,1969/1971,,,,,,,,,,"<a href=""https://digitalsc.lib.vt.edu/files/thumbnails/spec_forms/PubPermission.doc"" target=""_blank"">Permission to publish material from the Michael Collins Papers must be obtained from Special Collections, Virginia Tech.</a>",,,,,,,,,"Ms1989-029, Box 18, Folder 2a",,,,,,,,,,,,Clippings,Ms1989-029_B18_F2a_MichaelCollins_Clippings_1969-1971,"Researchers wishing to cite this collection should include the following information: Michael Collins Papers, Ms1989-029, Special Collections, Virginia Polytechnic Institute and State University, Blacksburg, Va.",,,,,,,,,,,,"<a href=""http://spec.lib.vt.edu/"" target=""_blank"">Special Collections, University Libraries, Virginia Tech</a>",,,,,,,,,,,,,,,,,,,,,,,,,,,,,,,,,,,,PDF,,,,,,,,,,,,,,,,,,,,,,,,,,,,,,,,,,,http://spec.lib.vt.edu/pickup/Omeka_upload/Ms1989-029_B18_F2a_MichaelCollins_Clippings_1969-1971.pdf,Document,"The Michael Collins Papers (Ms1989-029)",1,0
5392,https://digitalsc.lib.vt.edu/items/show/5392,"Clippings, Michael Collins at the State Department, 1969-1970 (Ms1989-029)",,"Science and Technology^^Archives of American Aerospace Exploration (AAAE)^^Astronauts^^Project Gemini (U.S.)^^United States. National Aeronautics and Space Administration","Collection of newspaper clippings from the time during and around Michael Collins' tenure at the State Department.",,,"Collins, Michael, 1930-","<a href=""http://search.vaheritage.org/vivaxtf/view?docId=vt/viblbv00092.xml"" target=""_blank"">See the Finding Aid for the Michael Collins Papers</a>",,1969/1971,,,,,,,,,,"<a href=""https://digitalsc.lib.vt.edu/files/thumbnails/spec_forms/PubPermission.doc"" target=""_blank"">Permission to publish material from the Michael Collins Papers must be obtained from Special Collections, Virginia Tech.</a>",,,,,,,,,"Ms1989-029, Box 18, Folder 2b",,,,,,,,,,,,Clippings,Ms1989-029_B18_F2b_MichaelCollins_Clippings_1969-1971,"Researchers wishing to cite this collection should include the following information: Michael Collins Papers, Ms1989-029, Special Collections, Virginia Polytechnic Institute and State University, Blacksburg, Va.",,,,,,,,,,,,"<a href=""http://spec.lib.vt.edu/"" target=""_blank"">Special Collections, University Libraries, Virginia Tech</a>",,,,,,,,,,,,,,,,,,,,,,,,,,,,,,,,,,,,PDF,,,,,,,,,,,,,,,,,,,,,,,,,,,,,,,,,,,http://spec.lib.vt.edu/pickup/Omeka_upload/Ms1989-029_B18_F2b_MichaelCollins_Clippings_1969-1971.pdf,Document,"The Michael Collins Papers (Ms1989-029)",1,0
5399,https://digitalsc.lib.vt.edu/items/show/5399,"Clippings, National Air and Space Museum, 1971-1979 (Part 1 of 2) (Ms1989-029)",,"Science and Technology^^Archives of American Aerospace Exploration (AAAE)^^Astronauts^^Project Gemini (U.S.)^^United States. National Aeronautics and Space Administration","Part 1 of 2 of a collection of clippings associated with the National Air and Space Museum between 1971-1979",,,"Collins, Michael, 1930-","<a href=""http://search.vaheritage.org/vivaxtf/view?docId=vt/viblbv00092.xml"" target=""_blank"">See the Finding Aid for the Michael Collins Papers</a>",,1971/1979,,,,,,,,,,"<a href=""https://digitalsc.lib.vt.edu/files/thumbnails/spec_forms/PubPermission.doc"" target=""_blank"">Permission to publish material from the Michael Collins Papers must be obtained from Special Collections, Virginia Tech.</a>",,,,,,,,,"Ms1989-029, Box 18, Folder 5a",,,,,,,,,,,,Clippings,Ms1989-029_B18_F5a_MichaelCollins_Clippings_1971-1979,"Researchers wishing to cite this collection should include the following information: Michael Collins Papers, Ms1989-029, Special Collections, Virginia Polytechnic Institute and State University, Blacksburg, Va.",,,,,,,,,,,,"<a href=""http://spec.lib.vt.edu/"" target=""_blank"">Special Collections, University Libraries, Virginia Tech</a>",,,,,,,,,,,,,,,,,,,,,,,,,,,,,,,,,,,,PDF,,,,,,,,,,,,,,,,,,,,,,,,,,,,,,,,,,,http://spec.lib.vt.edu/pickup/Omeka_upload/Ms1989-029_B18_F5a_MichaelCollins_Clippings_1971-1979.pdf,Document,"The Michael Collins Papers (Ms1989-029)",1,0
5400,https://digitalsc.lib.vt.edu/items/show/5400,"Clippings, National Air and Space Museum, 1971-1979 (Part 2 of 2) (Ms1989-029)",,"Science and Technology^^Archives of American Aerospace Exploration (AAAE)^^Astronauts^^Project Gemini (U.S.)^^United States. National Aeronautics and Space Administration","Part 2 of 2 of a collection of clippings associated with the National Air and Space Museum between 1971-1979",,,"Collins, Michael, 1930-","<a href=""http://search.vaheritage.org/vivaxtf/view?docId=vt/viblbv00092.xml"" target=""_blank"">See the Finding Aid for the Michael Collins Papers</a>",,1971/1979,,,,,,,,,,"<a href=""https://digitalsc.lib.vt.edu/files/thumbnails/spec_forms/PubPermission.doc"" target=""_blank"">Permission to publish material from the Michael Collins Papers must be obtained from Special Collections, Virginia Tech.</a>",,,,,,,,,"Ms1989-029, Box 18, Folder 5b",,,,,,,,,,,,Clippings,Ms1989-029_B18_F5b_MichaelCollins_Clippings_1971-1979,"Researchers wishing to cite this collection should include the following information: Michael Collins Papers, Ms1989-029, Special Collections, Virginia Polytechnic Institute and State University, Blacksburg, Va.",,,,,,,,,,,,"<a href=""http://spec.lib.vt.edu/"" target=""_blank"">Special Collections, University Libraries, Virginia Tech</a>",,,,,,,,,,,,,,,,,,,,,,,,,,,,,,,,,,,,PDF,,,,,,,,,,,,,,,,,,,,,,,,,,,,,,,,,,,http://spec.lib.vt.edu/pickup/Omeka_upload/Ms1989-029_B18_F5b_MichaelCollins_Clippings_1971-1979.pdf,Document,"The Michael Collins Papers (Ms1989-029)",1,0
5401,https://digitalsc.lib.vt.edu/items/show/5401,"Clippings, ""NASM Press Clippings, 1976-1977"", National Air and Space Museum, 1976-1977 (Ms1989-029)",,"Science and Technology^^Archives of American Aerospace Exploration (AAAE)^^Astronauts^^Project Gemini (U.S.)^^United States. National Aeronautics and Space Administration","A collection of clippings put together by the National Air and Space Museum featuring information about their work between 1976 and 1977.",,,"Collins, Michael, 1930-","<a href=""http://search.vaheritage.org/vivaxtf/view?docId=vt/viblbv00092.xml"" target=""_blank"">See the Finding Aid for the Michael Collins Papers</a>",,1976/1977,,,,,,,,,,"<a href=""https://digitalsc.lib.vt.edu/files/thumbnails/spec_forms/PubPermission.doc"" target=""_blank"">Permission to publish material from the Michael Collins Papers must be obtained from Special Collections, Virginia Tech.</a>",,,,,,,,,"Ms1989-029, Box 18, Folder 6",,,,,,,,,,,,Clippings,Ms1989-029_B18_F6_MichaelCollins_Clippings_1976,"Researchers wishing to cite this collection should include the following information: Michael Collins Papers, Ms1989-029, Special Collections, Virginia Polytechnic Institute and State University, Blacksburg, Va.",,,,,,,,,,,,"<a href=""http://spec.lib.vt.edu/"" target=""_blank"">Special Collections, University Libraries, Virginia Tech</a>",,,,,,,,,,,,,,,,,,,,,,,,,,,,,,,,,,,,PDF,,,,,,,,,,,,,,,,,,,,,,,,,,,,,,,,,,,http://spec.lib.vt.edu/pickup/Omeka_upload/Ms1989-029_B18_F6_MichaelCollins_Clippings_1976.pdf,Document,"The Michael Collins Papers (Ms1989-029)",1,0
5471,https://digitalsc.lib.vt.edu/items/show/5471,"Clipping, ""RADC Opening Contracting For SDI Battle Management Communications"", n.d. (Ms1989-029)",,"Science and Technology^^Archives of American Aerospace Exploration (AAAE)^^Astronauts^^Project Gemini (U.S.)^^United States. National Aeronautics and Space Administration","Small clipping for ""RADC Opening Contracting For SDI Battle Management Communications"". ""Andulis"" handwritten above article.",,,"Collins, Michael, 1930-","<a href=""http://search.vaheritage.org/vivaxtf/view?docId=vt/viblbv00092.xml"" target=""_blank"">See the Finding Aid for the Michael Collins Papers</a>",,n.d.,,,,,,,,,,"<a href=""https://digitalsc.lib.vt.edu/files/thumbnails/spec_forms/PubPermission.doc"" target=""_blank"">Permission to publish material from the Michael Collins Papers must be obtained from Special Collections, Virginia Tech.</a>",,,,,,,,,"Ms1989-029, Box 19, Folder 2",,,,,,,,,,,,Clippings,Ms1989-029_B19_F2_Clippings_1985_ND,"Researchers wishing to cite this collection should include the following information: Michael Collins Papers, Ms1989-029, Special Collections, Virginia Polytechnic Institute and State University, Blacksburg, Va.",,,,,,,,,,,,"<a href=""http://spec.lib.vt.edu/"" target=""_blank"">Special Collections, University Libraries, Virginia Tech</a>",,,,,,,,,,,,,,,,,,,,,,,,,,,,,,,,,,,,,,,,,,,,,,,,,,,,,,,,,,,,,,,,,,,,,,,http://spec.lib.vt.edu/pickup/Omeka_upload/Ms1989-029_B19_F2_Clippings_1985_ND.jpg,Document,"The Michael Collins Papers (Ms1989-029)",1,0
5515,https://digitalsc.lib.vt.edu/items/show/5515,"Clipping, ""National Space Club"", n.d. (Ms1989-029)",,"Science and Technology^^Archives of American Aerospace Exploration (AAAE)^^Astronauts^^Project Gemini (U.S.)^^United States. National Aeronautics and Space Administration","Clippings from an unknown publication regarding the National Space Club with attendence information for a October 24th luncheon.",,,"Collins, Michael, 1930-","<a href=""http://search.vaheritage.org/vivaxtf/view?docId=vt/viblbv00092.xml"" target=""_blank"">See the Finding Aid for the Michael Collins Papers</a>",,n.d.,,,,,,,,,,"<a href=""https://digitalsc.lib.vt.edu/files/thumbnails/spec_forms/PubPermission.doc"" target=""_blank"">Permission to publish material from the Michael Collins Papers must be obtained from Special Collections, Virginia Tech.</a>",,,,,,,,,"Ms1989-029, Box 19, Folder 12",,,,,,,,,,,,Clippings,Ms1989-029_B19_F12_Clipping_ND,"Researchers wishing to cite this collection should include the following information: Michael Collins Papers, Ms1989-029, Special Collections, Virginia Polytechnic Institute and State University, Blacksburg, Va.",,,,,,,,,,,,"<a href=""http://spec.lib.vt.edu/"" target=""_blank"">Special Collections, University Libraries, Virginia Tech</a>",,,,,,,,,,,,,,,,,,,,,,,,,,,,,,,,,,,,,,,,,,,,,,,,,,,,,,,,,,,,,,,,,,,,,,,"http://spec.lib.vt.edu/pickup/Omeka_upload/Ms1989-029_B19_F12_Clipping_NDa.jpg,http://spec.lib.vt.edu/pickup/Omeka_upload/Ms1989-029_B19_F12_Clipping_NDb.jpg",Document,"The Michael Collins Papers (Ms1989-029)",1,0
8238,https://digitalsc.lib.vt.edu/items/show/8238,"Women architects band together, Seattle, Washington, 1976. Newspaper article (Ms1998-022)",,Architects.,"Newspaper article from the Seattle Times that features Jean Young and several other architects who founded the group S.H.E., Sisters for a Human Environment. ",,,"Chebuhar, Theresa",,"The Seattle Times",1976,,,,,,,,,,,,,,,,,,,,,,,,,,,,,,en,Clippings,Ms1998_022_B002_F009_001_Pro_Ms_014,,,,,,,,,,,,,,,,,,,,,,,,,,,,,,,,,,,,,,,,,,,,,,,,,,,,,,,,,,,,,,,,,,,,,,,,,,,,,,,,,,,,https://digitalsc.lib.vt.edu/files/original/9ad31e64846a78002fff6eb39b427933.jpg,,"Jean Linden Young Papers, 1945-1997 (Ms1998-022)",1,0
8355,https://digitalsc.lib.vt.edu/items/show/8355,"Tech Looks for Diverse Faculty, Collegiate Times, December 3, 1999",,,,,,,,,1999-12-03,,,,,,,,,,"Permission to publish material from the Virginia Tech Black History Collection must be obtained from Special Collections, Virginia Tech.",,,,,,,,,,,,,,,,,,,,,Clippings,1999_Dec3_pg1and3,,,,,,,,,,,,,,,,,,,,,,,,,,,,,,,,,,,,,,,,,,,,,,,,,,,,,,,,,,,,,,,,,,,,,,,,,,,,,,,,,,,,http://spec.lib.vt.edu/pickup/Omeka_upload/1999_Dec3_pg1and3.pdf,Document,"Black History at Virginia Tech - Issues",1,0
8356,https://digitalsc.lib.vt.edu/items/show/8356,"Racial Equity in Education, Collegiate Times, October 7, 1999",,,,,,,,,1999-10-07,,,,,,,,,,"Permission to publish material from the Virginia Tech Black History Collection must be obtained from Special Collections, Virginia Tech.",,,,,,,,,,,,,,,,,,,,,Clippings,1999_Oct7_pg1and2,,,,,,,,,,,,,,,,,,,,,,,,,,,,,,,,,,,,,,,,,,,,,,,,,,,,,,,,,,,,,,,,,,,,,,,,,,,,,,,,,,,,http://spec.lib.vt.edu/pickup/Omeka_upload/1999_Oct7_pg1and2.pdf,Document,"Black History at Virginia Tech - Issues",1,0
8357,https://digitalsc.lib.vt.edu/items/show/8357,"Tech Continues to Acknowledge Low Minority Numbers, Collegiate Times, September 2, 1999",,,,,,,,,1999-09-02,,,,,,,,,,"Permission to publish material from the Virginia Tech Black History Collection must be obtained from Special Collections, Virginia Tech.",,,,,,,,,,,,,,,,,,,,,Clippings,1999_Sept2_pg1and2,,,,,,,,,,,,,,,,,,,,,,,,,,,,,,,,,,,,,,,,,,,,,,,,,,,,,,,,,,,,,,,,,,,,,,,,,,,,,,,,,,,,http://spec.lib.vt.edu/pickup/Omeka_upload/1999_Sept2_pg1and2.pdf,Document,"Black History at Virginia Tech - Issues",1,0
8358,https://digitalsc.lib.vt.edu/items/show/8358,"Students Oppose Tech Policy of Staying Open, Collegiate Times, January 16, 2001",,,,,,,,,2001-01-16,,,,,,,,,,"Permission to publish material from the Virginia Tech Black History Collection must be obtained from Special Collections, Virginia Tech.",,,,,,,,,,,,,,,,,,,,,Clippings,2001_Jan16,,,,,,,,,,,,,,,,,,,,,,,,,,,,,,,,,,,,,,,,,,,,,,,,,,,,,,,,,,,,,,,,,,,,,,,,,,,,,,,,,,,,http://spec.lib.vt.edu/pickup/Omeka_upload/2001_Jan16.pdf,Document,"Black History at Virginia Tech - Issues",1,0
8359,https://digitalsc.lib.vt.edu/items/show/8359,"Diversity Shakes up Tech, Collegiate Times, April 23, 2009",,,,,,,,,2009-04-23,,,,,,,,,,"Permission to publish material from the Virginia Tech Black History Collection must be obtained from Special Collections, Virginia Tech.",,,,,,,,,,,,,,,,,,,,,Clippings,2009_Apr23,,,,,,,,,,,,,,,,,,,,,,,,,,,,,,,,,,,,,,,,,,,,,,,,,,,,,,,,,,,,,,,,,,,,,,,,,,,,,,,,,,,,http://spec.lib.vt.edu/pickup/Omeka_upload/2009_Apr23.pdf,Document,"Black History at Virginia Tech - Issues",1,0
8360,https://digitalsc.lib.vt.edu/items/show/8360,"Students Discuss Diversity, Collegiate Times, April 24, 2009",,,,,,,,,2009-04-24,,,,,,,,,,"Permission to publish material from the Virginia Tech Black History Collection must be obtained from Special Collections, Virginia Tech.",,,,,,,,,,,,,,,,,,,,,Clippings,2009_Apr24_pg1_Diversity,,,,,,,,,,,,,,,,,,,,,,,,,,,,,,,,,,,,,,,,,,,,,,,,,,,,,,,,,,,,,,,,,,,,,,,,,,,,,,,,,,,,http://spec.lib.vt.edu/pickup/Omeka_upload/2009_Apr24_pg1_Diversity.jpg,Document,"Black History at Virginia Tech - Issues",1,0
8361,https://digitalsc.lib.vt.edu/items/show/8361,"Hokies March for Trayvon, Collegiate Times, March 28, 2012",,,,,,,,,2012-03-28,,,,,,,,,,"Permission to publish material from the Virginia Tech Black History Collection must be obtained from Special Collections, Virginia Tech.",,,,,,,,,,,,,,,,,,,,,Clippings,2012_Mar28_pg1and2,,,,,,,,,,,,,,,,,,,,,,,,,,,,,,,,,,,,,,,,,,,,,,,,,PDF,,,,,,,,,,,,,,,,,,,,,,,,,,,,,,,,,,,http://spec.lib.vt.edu/pickup/Omeka_upload/2012_Mar28_pg1and2.pdf,Document,"Black History at Virginia Tech - Issues",1,0
8362,https://digitalsc.lib.vt.edu/items/show/8362,"The 1964 Bugle, pg 119",,,,,,,,,1964,,,,,,,,,,"Permission to publish material from the Virginia Tech Black History Collection must be obtained from Special Collections, Virginia Tech.",,,,,,,,,,,,,,,,,,,,,Clippings,Bugle1964_pg119_Racism,,,,,,,,,,,,,,,,,,,,,,,,,,,,,,,,,,,,,,,,,,,,,,,,,,,,,,,,,,,,,,,,,,,,,,,,,,,,,,,,,,,,http://spec.lib.vt.edu/pickup/Omeka_upload/Bugle1964_pg119_Racism.jpg,Document,"Black History at Virginia Tech - Issues",1,0