﻿"Item Id","Item URI","Dublin Core:Title","Dublin Core:Alternative Title","Dublin Core:Subject","Dublin Core:Description","Dublin Core:Abstract","Dublin Core:Table Of Contents","Dublin Core:Creator","Dublin Core:Source","Dublin Core:Publisher","Dublin Core:Date","Dublin Core:Date Available","Dublin Core:Date Created","Dublin Core:Date Accepted","Dublin Core:Date Copyrighted","Dublin Core:Date Submitted","Dublin Core:Date Issued","Dublin Core:Date Modified","Dublin Core:Date Valid","Dublin Core:Contributor","Dublin Core:Rights","Dublin Core:Access Rights","Dublin Core:License","Dublin Core:Relation","Dublin Core:Conforms To","Dublin Core:Has Format","Dublin Core:Has Part","Dublin Core:Has Version","Dublin Core:Is Format Of","Dublin Core:Is Part Of","Dublin Core:Is Referenced By","Dublin Core:Is Replaced By","Dublin Core:Is Required By","Dublin Core:Is Version Of","Dublin Core:References","Dublin Core:Replaces","Dublin Core:Requires","Dublin Core:Format","Dublin Core:Extent","Dublin Core:Medium","Dublin Core:Language","Dublin Core:Type","Dublin Core:Identifier","Dublin Core:Bibliographic Citation","Dublin Core:Coverage","Dublin Core:Spatial Coverage","Dublin Core:Temporal Coverage","Dublin Core:Accrual Method","Dublin Core:Accrual Periodicity","Dublin Core:Accrual Policy","Dublin Core:Audience","Dublin Core:Audience Education Level","Dublin Core:Mediator","Dublin Core:Instructional Method","Dublin Core:Provenance","Dublin Core:Rights Holder","Item Type Metadata:Text","Item Type Metadata:Interviewer","Item Type Metadata:Interviewee","Item Type Metadata:Location","Item Type Metadata:Transcription","Item Type Metadata:Local URL","Item Type Metadata:Original Format","Item Type Metadata:Physical Dimensions","Item Type Metadata:Duration","Item Type Metadata:Compression","Item Type Metadata:Producer","Item Type Metadata:Director","Item Type Metadata:Bit Rate/Frequency","Item Type Metadata:Time Summary","Item Type Metadata:Email Body","Item Type Metadata:Subject Line","Item Type Metadata:From","Item Type Metadata:To","Item Type Metadata:CC","Item Type Metadata:BCC","Item Type Metadata:Number of Attachments","Item Type Metadata:Standards","Item Type Metadata:Objectives","Item Type Metadata:Materials","Item Type Metadata:Lesson Plan Text","Item Type Metadata:URL","Item Type Metadata:Event Type","Item Type Metadata:Participants","Item Type Metadata:Birth Date","Item Type Metadata:Birthplace","Item Type Metadata:Death Date","Item Type Metadata:Occupation","Item Type Metadata:Biographical Text","Item Type Metadata:Bibliography","Item Type Metadata:Transcript","Item Type Metadata:Viewer","Item Type Metadata:Player","Item Type Metadata:Frame Rate","Item Type Metadata:Display Resolution","Item Type Metadata:Production Team","Item Type Metadata:Narrator","Omeka Legacy File:Additional Creator","Omeka Legacy File:Transcriber","Omeka Legacy File:Producer","Omeka Legacy File:Render Device","Omeka Legacy File:Render Details","Omeka Legacy File:Capture Date","Omeka Legacy File:Capture Device","Omeka Legacy File:Capture Details","Omeka Legacy File:Change History","Omeka Legacy File:Watermark","Omeka Legacy File:Encryption","Omeka Legacy File:Compression","Omeka Legacy File:Post Processing","Omeka Image File:Width","Omeka Image File:Height","Omeka Image File:Bit Depth","Omeka Image File:Channels","Omeka Image File:Exif String","Omeka Image File:Exif Array","Omeka Image File:IPTC String","Omeka Image File:IPTC Array","Omeka Video File:Bitrate","Omeka Video File:Duration","Omeka Video File:Sample Rate","Omeka Video File:Codec","Omeka Video File:Width","Omeka Video File:Height","PDF Text:Text",tags,file,itemType,collection,public,featured
5392,https://digitalsc.lib.vt.edu/items/show/5392,"Clippings, Michael Collins at the State Department, 1969-1970 (Ms1989-029)",,"Science and Technology^^Archives of American Aerospace Exploration (AAAE)^^Astronauts^^Project Gemini (U.S.)^^United States. National Aeronautics and Space Administration","Collection of newspaper clippings from the time during and around Michael Collins' tenure at the State Department.",,,"Collins, Michael, 1930-","<a href=""http://search.vaheritage.org/vivaxtf/view?docId=vt/viblbv00092.xml"" target=""_blank"">See the Finding Aid for the Michael Collins Papers</a>",,1969/1971,,,,,,,,,,"<a href=""https://digitalsc.lib.vt.edu/files/thumbnails/spec_forms/PubPermission.doc"" target=""_blank"">Permission to publish material from the Michael Collins Papers must be obtained from Special Collections, Virginia Tech.</a>",,,,,,,,,"Ms1989-029, Box 18, Folder 2b",,,,,,,,,,,,Clippings,Ms1989-029_B18_F2b_MichaelCollins_Clippings_1969-1971,"Researchers wishing to cite this collection should include the following information: Michael Collins Papers, Ms1989-029, Special Collections, Virginia Polytechnic Institute and State University, Blacksburg, Va.",,,,,,,,,,,,"<a href=""http://spec.lib.vt.edu/"" target=""_blank"">Special Collections, University Libraries, Virginia Tech</a>",,,,,,,,,,,,,,,,,,,,,,,,,,,,,,,,,,,,PDF,,,,,,,,,,,,,,,,,,,,,,,,,,,,,,,,,,,http://spec.lib.vt.edu/pickup/Omeka_upload/Ms1989-029_B18_F2b_MichaelCollins_Clippings_1969-1971.pdf,Document,"The Michael Collins Papers (Ms1989-029)",1,0
17413,https://digitalsc.lib.vt.edu/items/show/17413,"Clippings, Argonaut Critical Reactor, 1959",,"University History^^University Archives^^Virginia Polytechnic Institute","This newspaper clipping shows a photo of the construction of a new Physics building that would house the Argonaut Critical Reactor.",,,"The Techgram","150th Anniversary of Virginia Tech Collection",,1959,,,,,,,,,,"The copyright and related rights status of this Item has not been evaluated. Please contact Special Collections and University Archives for more information. You are free to use this Item in any way that is permitted by the copyright and related rights legislation that applies to your use. <a target=""_blank"" href=""http://rightsstatements.org/vocab/CNE/1.0/"" rel=""noreferrer noopener"">http://rightsstatements.org/vocab/CNE/1.0/</a>",,,,,,,,,"150th Anniversary of Virginia Tech Collection",,,,,,,,image/jpg,,,,Clippings,150th_Argonaut,"Researchers wishing to cite this collection should include the following information: [identification of item], 150th Anniversary of Virginia Tech Collection, Special Collections and University Archives, Virginia Tech, Blacksburg, Va.",,,,,,,,,,,,"Special Collections and University Archives, Virginia Tech",,,,,,,,,,,,,,,,,,,,,,,,,,,,,,,,,,,,,,,,,,,,,,,,,,,,,,,,,,,,,,,,,,,,,,,https://digitalsc.lib.vt.edu/files/original/7ba2577f39e4b2850af2946b3a7fbd87.jpg,"Still Image","150th Anniversary of Virginia Tech Collection",1,0
5390,https://digitalsc.lib.vt.edu/items/show/5390,"Clippings, ""State Department Astronaut"", 1969-1971 (Ms1989)",,"Science and Technology^^Archives of American Aerospace Exploration (AAAE)^^Astronauts^^Project Gemini (U.S.)^^United States. National Aeronautics and Space Administration","Collection of Newspaper Clippings pertaining to Michael Collins' tenure at the State Department.",,,"Collins, Michael, 1930-","<a href=""http://search.vaheritage.org/vivaxtf/view?docId=vt/viblbv00092.xml"" target=""_blank"">See the Finding Aid for the Michael Collins Papers</a>",,1969/1971,,,,,,,,,,"<a href=""https://digitalsc.lib.vt.edu/files/thumbnails/spec_forms/PubPermission.doc"" target=""_blank"">Permission to publish material from the Michael Collins Papers must be obtained from Special Collections, Virginia Tech.</a>",,,,,,,,,"Ms1989-029, Box 18, Folder 2a",,,,,,,,,,,,Clippings,Ms1989-029_B18_F2a_MichaelCollins_Clippings_1969-1971,"Researchers wishing to cite this collection should include the following information: Michael Collins Papers, Ms1989-029, Special Collections, Virginia Polytechnic Institute and State University, Blacksburg, Va.",,,,,,,,,,,,"<a href=""http://spec.lib.vt.edu/"" target=""_blank"">Special Collections, University Libraries, Virginia Tech</a>",,,,,,,,,,,,,,,,,,,,,,,,,,,,,,,,,,,,PDF,,,,,,,,,,,,,,,,,,,,,,,,,,,,,,,,,,,http://spec.lib.vt.edu/pickup/Omeka_upload/Ms1989-029_B18_F2a_MichaelCollins_Clippings_1969-1971.pdf,Document,"The Michael Collins Papers (Ms1989-029)",1,0
5401,https://digitalsc.lib.vt.edu/items/show/5401,"Clippings, ""NASM Press Clippings, 1976-1977"", National Air and Space Museum, 1976-1977 (Ms1989-029)",,"Science and Technology^^Archives of American Aerospace Exploration (AAAE)^^Astronauts^^Project Gemini (U.S.)^^United States. National Aeronautics and Space Administration","A collection of clippings put together by the National Air and Space Museum featuring information about their work between 1976 and 1977.",,,"Collins, Michael, 1930-","<a href=""http://search.vaheritage.org/vivaxtf/view?docId=vt/viblbv00092.xml"" target=""_blank"">See the Finding Aid for the Michael Collins Papers</a>",,1976/1977,,,,,,,,,,"<a href=""https://digitalsc.lib.vt.edu/files/thumbnails/spec_forms/PubPermission.doc"" target=""_blank"">Permission to publish material from the Michael Collins Papers must be obtained from Special Collections, Virginia Tech.</a>",,,,,,,,,"Ms1989-029, Box 18, Folder 6",,,,,,,,,,,,Clippings,Ms1989-029_B18_F6_MichaelCollins_Clippings_1976,"Researchers wishing to cite this collection should include the following information: Michael Collins Papers, Ms1989-029, Special Collections, Virginia Polytechnic Institute and State University, Blacksburg, Va.",,,,,,,,,,,,"<a href=""http://spec.lib.vt.edu/"" target=""_blank"">Special Collections, University Libraries, Virginia Tech</a>",,,,,,,,,,,,,,,,,,,,,,,,,,,,,,,,,,,,PDF,,,,,,,,,,,,,,,,,,,,,,,,,,,,,,,,,,,http://spec.lib.vt.edu/pickup/Omeka_upload/Ms1989-029_B18_F6_MichaelCollins_Clippings_1976.pdf,Document,"The Michael Collins Papers (Ms1989-029)",1,0
5368,https://digitalsc.lib.vt.edu/items/show/5368,"Clippings, ""NASA Current News"", Michael Collins, Aug 8, 1969 (Ms1989-029)",,"Science and Technology^^Archives of American Aerospace Exploration (AAAE)^^Astronauts^^Project Gemini (U.S.)^^United States. National Aeronautics and Space Administration","NASA-collected newsclippings from Aug 7, 1969 regarding their various activities.",,,"Collins, Michael, 1930-","<a href=""http://search.vaheritage.org/vivaxtf/view?docId=vt/viblbv00092.xml"" target=""_blank"">See the Finding Aid for the Michael Collins Papers</a>",,1969-08-08,,,,,,,,,,"<a href=""https://digitalsc.lib.vt.edu/files/thumbnails/spec_forms/PubPermission.doc"" target=""_blank"">Permission to publish material from the Michael Collins Papers must be obtained from Special Collections, Virginia Tech.</a>",,,,,,,,,"Ms1989-029, Box 14, Folder 2",,,,,,,,,,,,Clippings,Ms1989-029_B14_F2,"Researchers wishing to cite this collection should include the following information: Michael Collins Papers, Ms1989-029, Special Collections, Virginia Polytechnic Institute and State University, Blacksburg, Va.",,,,,,,,,,,,"<a href=""http://spec.lib.vt.edu/"" target=""_blank"">Special Collections, University Libraries, Virginia Tech</a>",,,,,,,,,,,,,,,,,,,,,,,,,,,,,,,,,,,,PDF,,,,,,,,,,,,,,,,,,,,,,,,,,,,,,,,,,,http://spec.lib.vt.edu/pickup/Omeka_upload/Ms1989-029_B14_F2.pdf,Document,"The Michael Collins Papers (Ms1989-029)",1,0
5367,https://digitalsc.lib.vt.edu/items/show/5367,"Clippings, ""NASA Current News"", Michael Collins, Aug 7, 1969 (Ms1989-029)",,"Science and Technology^^Archives of American Aerospace Exploration (AAAE)^^Astronauts^^Project Gemini (U.S.)^^United States. National Aeronautics and Space Administration","NASA-collected newsclippings from Aug 7, 1969 regarding their various activities.",,,"Collins, Michael, 1930-","<a href=""http://search.vaheritage.org/vivaxtf/view?docId=vt/viblbv00092.xml"" target=""_blank"">See the Finding Aid for the Michael Collins Papers</a>",,1969-08-07,,,,,,,,,,"<a href=""https://digitalsc.lib.vt.edu/files/thumbnails/spec_forms/PubPermission.doc"" target=""_blank"">Permission to publish material from the Michael Collins Papers must be obtained from Special Collections, Virginia Tech.</a>",,,,,,,,,"Ms1989-029, Box 14, Folder 1",,,,,,,,,,,,Clippings,Ms1989-029_B14_F1,"Researchers wishing to cite this collection should include the following information: Michael Collins Papers, Ms1989-029, Special Collections, Virginia Polytechnic Institute and State University, Blacksburg, Va.",,,,,,,,,,,,"<a href=""http://spec.lib.vt.edu/"" target=""_blank"">Special Collections, University Libraries, Virginia Tech</a>",,,,,,,,,,,,,,,,,,,,,,,,,,,,,,,,,,,,PDF,,,,,,,,,,,,,,,,,,,,,,,,,,,,,,,,,,,http://spec.lib.vt.edu/pickup/Omeka_upload/Ms1989-029_B14_F1.pdf,Document,"The Michael Collins Papers (Ms1989-029)",1,0
5370,https://digitalsc.lib.vt.edu/items/show/5370,"Clippings, ""NASA Current News Apollo 11 Special Issue"", Michael Collins, Jul-Aug, 1969 [2 of 2] (Ms1989-029)",,"Science and Technology^^Archives of American Aerospace Exploration (AAAE)^^Astronauts^^Project Gemini (U.S.)^^United States. National Aeronautics and Space Administration","Part 2 of 2 of NASA-collected newsclippings from Aug 7, 1969 specifically regarding the Apollo 2 mission.",,,"Collins, Michael, 1930-","<a href=""http://search.vaheritage.org/vivaxtf/view?docId=vt/viblbv00092.xml"" target=""_blank"">See the Finding Aid for the Michael Collins Papers</a>",,1969-07/1969-08,,,,,,,,,,"<a href=""https://digitalsc.lib.vt.edu/files/thumbnails/spec_forms/PubPermission.doc"" target=""_blank"">Permission to publish material from the Michael Collins Papers must be obtained from Special Collections, Virginia Tech.</a>",,,,,,,,,"Ms1989-029, Box 14, Folder 3b",,,,,,,,,,,,Clippings,Ms1989-029_B14_F3b,"Researchers wishing to cite this collection should include the following information: Michael Collins Papers, Ms1989-029, Special Collections, Virginia Polytechnic Institute and State University, Blacksburg, Va.",,,,,,,,,,,,"<a href=""http://spec.lib.vt.edu/"" target=""_blank"">Special Collections, University Libraries, Virginia Tech</a>",,,,,,,,,,,,,,,,,,,,,,,,,,,,,,,,,,,,PDF,,,,,,,,,,,,,,,,,,,,,,,,,,,,,,,,,,,http://spec.lib.vt.edu/pickup/Omeka_upload/Ms1989-029_B14_F3b.pdf,Document,"The Michael Collins Papers (Ms1989-029)",1,0
5369,https://digitalsc.lib.vt.edu/items/show/5369,"Clippings, ""NASA Current News Apollo 11 Special Issue"", Michael Collins, Jul-Aug, 1969 [1 of 2] (Ms1989-029)",,"Science and Technology^^Archives of American Aerospace Exploration (AAAE)^^Astronauts^^Project Gemini (U.S.)^^United States. National Aeronautics and Space Administration","Part 1 of 2 of NASA-collected newsclippings from Aug 7, 1969 specifically regarding the Apollo 2 mission.",,,"Collins, Michael, 1930-","<a href=""http://search.vaheritage.org/vivaxtf/view?docId=vt/viblbv00092.xml"" target=""_blank"">See the Finding Aid for the Michael Collins Papers</a>",,1969-07/1969-08,,,,,,,,,,"<a href=""https://digitalsc.lib.vt.edu/files/thumbnails/spec_forms/PubPermission.doc"" target=""_blank"">Permission to publish material from the Michael Collins Papers must be obtained from Special Collections, Virginia Tech.</a>",,,,,,,,,"Ms1989-029, Box 14, Folder 3a",,,,,,,,,,,,Clippings,Ms1989-029_B14_F3a,"Researchers wishing to cite this collection should include the following information: Michael Collins Papers, Ms1989-029, Special Collections, Virginia Polytechnic Institute and State University, Blacksburg, Va.",,,,,,,,,,,,"<a href=""http://spec.lib.vt.edu/"" target=""_blank"">Special Collections, University Libraries, Virginia Tech</a>",,,,,,,,,,,,,,,,,,,,,,,,,,,,,,,,,,,,PDF,,,,,,,,,,,,,,,,,,,,,,,,,,,,,,,,,,,http://spec.lib.vt.edu/pickup/Omeka_upload/Ms1989-029_B14_F3a.pdf,Document,"The Michael Collins Papers (Ms1989-029)",1,0
17531,https://digitalsc.lib.vt.edu/items/show/17531,"Clippings, ""Locomotive Lady"" by Robert M. Hyatt, <i>Boston Herald-Tribune</i>, 1946-04-21",,"University History^^University Archives^^Virginia Polytechnic Institute","These clippings from ""Locomotive Lady"" by Robert M. Hyatt, <i>Boston Herald-Tribune</i>, contain a story about Carmen Venegas, VPI's first international woman graduate. The text and images depict her working on a railroad and other engineering duties, April 21, 1946.",,,,"<a href=""https://ead.lib.virginia.edu/vivaxtf/view?docId=oai/lib.vt.edu/repositories/2/resources/3151.oai_ead.xml"" target=""_blank"" rel=""noreferrer noopener"">See the finding aid for the Virginia Tech and Local History Mounted Clippings.</a>",,1946-04-21,,,,,,,,,,"The copyright and related rights status of this Item has not been evaluated. Please contact Special Collections and University Archives for more information. You are free to use this Item in any way that is permitted by the copyright and related rights legislation that applies to your use. <a target=""_blank"" href=""http://rightsstatements.org/vocab/CNE/1.0/"" rel=""noreferrer noopener"">http://rightsstatements.org/vocab/CNE/1.0/</a>",,,,,,,,,"Virginia Tech and Local History Mounted Clippings, Box 79",,,,,,,,image/jpg,,,English,Clippings,MC_Mla114_1946,"Researchers wishing to cite this collection should include the following information: [identification of item], [folder], Virginia Tech and Local History Mounted Clippings, Special Collections and University Archives, Virginia Tech, Blacksburg, Va.",,,,,,,,,,,,"Special Collections and University Archives, Virginia Tech",,,,,,,,,,,,,,,,,,,,,,,,,,,,,,,,,,,,,,,,,,,,,,,,,,,,,,,,,,,,,,,,,,,,,,,"https://digitalsc.lib.vt.edu/files/original/175dc16a91d61bd4278fe1674bfecf5d.jpg,https://digitalsc.lib.vt.edu/files/original/b46f1d5fe089309e26c3fe42eca56a65.jpg","Still Image","150th Anniversary of Virginia Tech Collection",1,0
9087,https://digitalsc.lib.vt.edu/items/show/9087,"Clippings from the Dixie Controversy, Highty Tighties Book",,"University History",,,,,,,1971,,,,,,,,,,"Permission to publish material from the Virginia Tech Black History Collection must be obtained from Special Collections, Virginia Tech.",,,,,,,,,,,,,,,,,,,,,Clippings,Dixie_HightyTighty,,,,,,,,,,,,,,,,,,,,,,,,,,,,,,,,,,,,,,,,,,,,,,,,,PDF,,,,,,,,,,,,,,,,,,,,,,,,,,,,,,,,,,,http://spec.lib.vt.edu/pickup/Omeka_upload/Dixie_HightyTighty.pdf,Document,"Black History at Virginia Tech - Issues",1,0
5285,https://digitalsc.lib.vt.edu/items/show/5285,"Clipping, The New York Times article ""Gemini 10 Flight Ends With a Splashdown 3 Miles From Target"", July 22, 1966.(Ms1989-029)",,"Science and Technology^^Archives of American Aerospace Exploration (AAAE)^^Astronauts^^Project Gemini (U.S.)^^United States. National Aeronautics and Space Administration","The New York Times article ""Gemini 10 Flight Ends With a Splashdown 3 Miles From Target"", July 22, 1966.",,,"Collins, Michael, 1930-","<a href=""http://search.vaheritage.org/vivaxtf/view?docId=vt/viblbv00092.xml"" target=""_blank"">See the Finding Aid for the Michael Collins Papers</a>",,1966-07-22,,,,,,,,,,"<a href=""https://digitalsc.lib.vt.edu/files/thumbnails/spec_forms/PubPermission.doc"" target=""_blank"">Permission to publish material from the Michael Collins Papers must be obtained from Special Collections, Virginia Tech.</a>",,,,,,,,,"Ms1989-029, Box 7, Folder 2",,,,,,,,,,,,Clippings,Ms1989-029_B07_F2_Clippings_1966_0722_01,"Researchers wishing to cite this collection should include the following information: Michael Collins Papers, Ms1989-029, Special Collections, Virginia Polytechnic Institute and State University, Blacksburg, Va.",,,,,,,,,,,,"<a href=""http://spec.lib.vt.edu/"" target=""_blank"">Special Collections, University Libraries, Virginia Tech</a>",,,,,,,,,,,,,,,,,,,,,,,,,,,,,,,,,,,,,,,,,,,,,,,,,,,,,,,,,,,,,,,,,,,,,,,http://spec.lib.vt.edu/pickup/Omeka_upload/Ms1989-029_B07_F2_Clippings_1966_0722_01.jpg,Document,"The Michael Collins Papers (Ms1989-029)",1,0
17472,https://digitalsc.lib.vt.edu/items/show/17472,"Clipping, Rural Electrification, 1924",,"University History^^University Archives^^Virginia Agricultural and Mechanical College and Polytechnic Institute","This newspaper clipping shows a photograph of electic lines leading to an unidentified farm.",,,,"150th Anniversary of Virginia Tech Collection",,1924,,,,,,,,,,"The copyright and related rights status of this Item has not been evaluated. Please contact Special Collections and University Archives for more information. You are free to use this Item in any way that is permitted by the copyright and related rights legislation that applies to your use. <a target=""_blank"" href=""http://rightsstatements.org/vocab/CNE/1.0/"" rel=""noreferrer noopener"">http://rightsstatements.org/vocab/CNE/1.0/</a>",,,,,,,,,"150th Anniversary of Virginia Tech Collection",,,,,,,,image/jpg,,,,Clippings,"150th_097. rural electrification 1924","Researchers wishing to cite this collection should include the following information: [identification of item], 150th Anniversary of Virginia Tech Collection, Special Collections and University Archives, Virginia Tech, Blacksburg, Va.",,,,,,,,,,,,"Special Collections and University Archives, Virginia Tech",,,,,,,,,,,,,,,,,,,,,,,,,,,,,,,,,,,,,,,,,,,,,,,,,,,,,,,,,,,,,,,,,,,,,,,https://digitalsc.lib.vt.edu/files/original/2ff943f492a22a00f149b815e6a74e42.jpg,"Still Image","150th Anniversary of Virginia Tech Collection",1,0
5292,https://digitalsc.lib.vt.edu/items/show/5292,"Clipping, Newspaper Articles ""U.S.-Soviet Box Score on Astronauts' Flights"", ""Astronauts Back at the Cape, Reporting Columbus was Right"", and ""Mike's Walk Reel Mystery"", July 21-23, 1966.(Ms1989-029)",,"Science and Technology^^Archives of American Aerospace Exploration (AAAE)^^Astronauts^^Project Gemini (U.S.)^^United States. National Aeronautics and Space Administration","Newspaper Articles ""U.S.-Soviet Box Score on Astronauts' Flights"", ""Astronauts Back at the Cape, Reporting Columbus was Right"", and ""Mike's Walk Reel Mystery"", July 21-23, 1966.",,,"Collins, Michael, 1930-","<a href=""http://search.vaheritage.org/vivaxtf/view?docId=vt/viblbv00092.xml"" target=""_blank"">See the Finding Aid for the Michael Collins Papers</a>",,n.d.,,,,,,,,,,"<a href=""https://digitalsc.lib.vt.edu/files/thumbnails/spec_forms/PubPermission.doc"" target=""_blank"">Permission to publish material from the Michael Collins Papers must be obtained from Special Collections, Virginia Tech.</a>",,,,,,,,,"Ms1989-029, Box 7, Folder 2",,,,,,,,,,,,Clippings,Ms1989-029_B07_F2_Clippings_1966_ND_05,"Researchers wishing to cite this collection should include the following information: Michael Collins Papers, Ms1989-029, Special Collections, Virginia Polytechnic Institute and State University, Blacksburg, Va.",,,,,,,,,,,,"<a href=""http://spec.lib.vt.edu/"" target=""_blank"">Special Collections, University Libraries, Virginia Tech</a>",,,,,,,,,,,,,,,,,,,,,,,,,,,,,,,,,,,,,,,,,,,,,,,,,,,,,,,,,,,,,,,,,,,,,,,http://spec.lib.vt.edu/pickup/Omeka_upload/Ms1989-029_B07_F2_Clippings_1966_ND_05.jpg,Document,"The Michael Collins Papers (Ms1989-029)",1,0