﻿"Item Id","Item URI","Dublin Core:Title","Dublin Core:Alternative Title","Dublin Core:Subject","Dublin Core:Description","Dublin Core:Abstract","Dublin Core:Table Of Contents","Dublin Core:Creator","Dublin Core:Source","Dublin Core:Publisher","Dublin Core:Date","Dublin Core:Date Available","Dublin Core:Date Created","Dublin Core:Date Accepted","Dublin Core:Date Copyrighted","Dublin Core:Date Submitted","Dublin Core:Date Issued","Dublin Core:Date Modified","Dublin Core:Date Valid","Dublin Core:Contributor","Dublin Core:Rights","Dublin Core:Access Rights","Dublin Core:License","Dublin Core:Relation","Dublin Core:Conforms To","Dublin Core:Has Format","Dublin Core:Has Part","Dublin Core:Has Version","Dublin Core:Is Format Of","Dublin Core:Is Part Of","Dublin Core:Is Referenced By","Dublin Core:Is Replaced By","Dublin Core:Is Required By","Dublin Core:Is Version Of","Dublin Core:References","Dublin Core:Replaces","Dublin Core:Requires","Dublin Core:Format","Dublin Core:Extent","Dublin Core:Medium","Dublin Core:Language","Dublin Core:Type","Dublin Core:Identifier","Dublin Core:Bibliographic Citation","Dublin Core:Coverage","Dublin Core:Spatial Coverage","Dublin Core:Temporal Coverage","Dublin Core:Accrual Method","Dublin Core:Accrual Periodicity","Dublin Core:Accrual Policy","Dublin Core:Audience","Dublin Core:Audience Education Level","Dublin Core:Mediator","Dublin Core:Instructional Method","Dublin Core:Provenance","Dublin Core:Rights Holder","Item Type Metadata:Text","Item Type Metadata:Interviewer","Item Type Metadata:Interviewee","Item Type Metadata:Location","Item Type Metadata:Transcription","Item Type Metadata:Local URL","Item Type Metadata:Original Format","Item Type Metadata:Physical Dimensions","Item Type Metadata:Duration","Item Type Metadata:Compression","Item Type Metadata:Producer","Item Type Metadata:Director","Item Type Metadata:Bit Rate/Frequency","Item Type Metadata:Time Summary","Item Type Metadata:Email Body","Item Type Metadata:Subject Line","Item Type Metadata:From","Item Type Metadata:To","Item Type Metadata:CC","Item Type Metadata:BCC","Item Type Metadata:Number of Attachments","Item Type Metadata:Standards","Item Type Metadata:Objectives","Item Type Metadata:Materials","Item Type Metadata:Lesson Plan Text","Item Type Metadata:URL","Item Type Metadata:Event Type","Item Type Metadata:Participants","Item Type Metadata:Birth Date","Item Type Metadata:Birthplace","Item Type Metadata:Death Date","Item Type Metadata:Occupation","Item Type Metadata:Biographical Text","Item Type Metadata:Bibliography","Item Type Metadata:Transcript","Item Type Metadata:Viewer","Item Type Metadata:Player","Item Type Metadata:Frame Rate","Item Type Metadata:Display Resolution","Item Type Metadata:Production Team","Item Type Metadata:Narrator","Omeka Legacy File:Additional Creator","Omeka Legacy File:Transcriber","Omeka Legacy File:Producer","Omeka Legacy File:Render Device","Omeka Legacy File:Render Details","Omeka Legacy File:Capture Date","Omeka Legacy File:Capture Device","Omeka Legacy File:Capture Details","Omeka Legacy File:Change History","Omeka Legacy File:Watermark","Omeka Legacy File:Encryption","Omeka Legacy File:Compression","Omeka Legacy File:Post Processing","Omeka Image File:Width","Omeka Image File:Height","Omeka Image File:Bit Depth","Omeka Image File:Channels","Omeka Image File:Exif String","Omeka Image File:Exif Array","Omeka Image File:IPTC String","Omeka Image File:IPTC Array","Omeka Video File:Bitrate","Omeka Video File:Duration","Omeka Video File:Sample Rate","Omeka Video File:Codec","Omeka Video File:Width","Omeka Video File:Height","PDF Text:Text",tags,file,itemType,collection,public,featured
6740,https://digitalsc.lib.vt.edu/items/show/6740,"Card and photograph from Botetourt Elementary",,,,,,"Botetourt Elementary School",,"Digital Library and Archives, University Libraries, Virginia Tech",,,"c. 2007",,,,,,,"Alex Grizzard","Unless otherwise noted, Virginia Tech owns the materials in the Virginia Tech April 16, 2007, Archives of the University Libraries, and retains copyright for the physical and digital materials that comprise the Archives. For further information see http://scholar.lib.vt.edu/prevail/copyright416.html","Unless otherwise noted this resource is available to the public.",,,,,,,,,,,,,,,,,,,,"Document^^Still Image",S4L7C0348,,,"Glouchester^^Virginia^^United States^^230161",,,,,,,,,,,,,,,,,,,,,,,,,,,,,,,,,,,,,,,,,,,,,,,,,,,,,,,,,,,,,,,,,,,,,,,,,,,,,,,,,http://spec.lib.vt.edu/pickup/Omeka_upload/S4L7C0348.jpg,,"Virginia Tech April 16, 2007 Archives of the University Libraries (MS2008-020)",1,0
6744,https://digitalsc.lib.vt.edu/items/show/6744,"Letter and photograph from Sun Trust Bank Education Loans",,,,,,"SunTrust Bank. Education Loans",,"Digital Library and Archives, University Libraries, Virginia Tech",,,4/20/2007,,,,,,,"Paul Rossi","Unless otherwise noted, Virginia Tech owns the materials in the Virginia Tech April 16, 2007, Archives of the University Libraries, and retains copyright for the physical and digital materials that comprise the Archives. For further information see http://scholar.lib.vt.edu/prevail/copyright416.html","Unless otherwise noted this resource is available to the public.",,,,,,,,,,,,,,,,,,,,"Document^^Still Image",S5L15C2199,,,"Richmond^^Virginia^^United States^^23224",,,,,,,,,,,,,,,,,,,,,,,,,,,,,,,,,,,,,,,,,,,,,,,,,,,,,,,,,,,,,,,,,,,,,,,,,,,,,,,,,http://spec.lib.vt.edu/pickup/Omeka_upload/S5L15C2199.jpg,,"Virginia Tech April 16, 2007 Archives of the University Libraries (MS2008-020)",1,0
6767,https://digitalsc.lib.vt.edu/items/show/6767,"Photograph from Blackwater USA inc. employees",,"Portraits, Group",,,,"Blackwater USA Inc.",,"Digital Library and Archives, University Libraries, Virginia Tech",,,"c. 2007",,,,,,,"Paul Rossi","Unless otherwise noted, Virginia Tech owns the materials in the Virginia Tech April 16, 2007, Archives of the University Libraries, and retains copyright for the physical and digital materials that comprise the Archives. For further information see http://scholar.lib.vt.edu/prevail/copyright416.html","Unless otherwise noted this resource is available to the public.",,,,,,,,,,,,,,,,,,,,"Still Image",S5L21F0045,,,"Moyock^^North Carolina^^United States^^27958",,,,,,,,,,,,,,,,,,,,,,,,,,,,,,,,,,,,,,,,,,,,,,,,,,,,,,,,,,,,,,,,,,,,,,,,,,,,,,,,,http://spec.lib.vt.edu/pickup/Omeka_upload/S5L21F0045.jpg,,"Virginia Tech April 16, 2007 Archives of the University Libraries (MS2008-020)",1,0
6779,https://digitalsc.lib.vt.edu/items/show/6779,"Photograph of Musselman Middle School students forming a large VT sign and a letter from Principal",,"Portraits, Group",,,,"Musselman Middle School",,"Digital Library and Archives, University Libraries, Virginia Tech",,,4/20/2007,,,,,,,"Paul Rossi","Unless otherwise noted, Virginia Tech owns the materials in the Virginia Tech April 16, 2007, Archives of the University Libraries, and retains copyright for the physical and digital materials that comprise the Archives. For further information see http://scholar.lib.vt.edu/prevail/copyright416.html","Unless otherwise noted this resource is available to the public.",,,,,,,,,,,,,,,,,,,,"Still Image",S5L26F0001,,,"Bunker Hill^^West Virginia^^United States^^25413",,,,,,,,,,,,,,,,,,,,,,,,,,,,,,,,,,,,,,,,,,,,,,,,,,,,,,,,,,,,,,,,,,,,,,,,,,,,,,,,,http://spec.lib.vt.edu/pickup/Omeka_upload/S5L26F0001.jpg,,"Virginia Tech April 16, 2007 Archives of the University Libraries (MS2008-020)",1,0
6780,https://digitalsc.lib.vt.edu/items/show/6780,"Photograph of Frederick Douglass Elementary School 4th Grade Class students",,"Portraits, Group",,,,"Frederick Douglass Elementary School",,"Digital Library and Archives, University Libraries, Virginia Tech",,,"c. 2007",,,,,,,"Paul Rossi","Unless otherwise noted, Virginia Tech owns the materials in the Virginia Tech April 16, 2007, Archives of the University Libraries, and retains copyright for the physical and digital materials that comprise the Archives. For further information see http://scholar.lib.vt.edu/prevail/copyright416.html","Unless otherwise noted this resource is available to the public.",,,,,,,,,,,,,,,,,,,,"Still Image",S5L26F0002,,,"Winchester^^Virginia^^United States^^22601",,,,,,,,,,,,,,,,,,,,,,,,,,,,,,,,,,,,,,,,,,,,,,,,,,,,,,,,,,,,,,,,,,,,,,,,,,,,,,,,,http://spec.lib.vt.edu/pickup/Omeka_upload/S5L26F0002.jpg,,"Virginia Tech April 16, 2007 Archives of the University Libraries (MS2008-020)",1,0
6781,https://digitalsc.lib.vt.edu/items/show/6781,"Photograph of Western Connecticut State University students signing a banner to send to Virginia Tech",,"Portraits, Group",,,,"Western Connecticut State University",,"Digital Library and Archives, University Libraries, Virginia Tech",,,"c. 2007",,,,,,,"Paul Rossi","Unless otherwise noted, Virginia Tech owns the materials in the Virginia Tech April 16, 2007, Archives of the University Libraries, and retains copyright for the physical and digital materials that comprise the Archives. For further information see http://scholar.lib.vt.edu/prevail/copyright416.html","Unless otherwise noted this resource is available to the public.",,,,,,,,,,,,,,,,,,,,"Still Image",S5L26F0004,,,"Danbury^^Connecticut^^United States^^06810",,,,,,,,,,,,,,,,,,,,,,,,,,,,,,,,,,,,,,,,,,,,,,,,,,,,,,,,,,,,,,,,,,,,,,,,,,,,,,,,,http://spec.lib.vt.edu/pickup/Omeka_upload/S5L26F0004.jpg,,"Virginia Tech April 16, 2007 Archives of the University Libraries (MS2008-020)",1,0
6782,https://digitalsc.lib.vt.edu/items/show/6782,"Photograph of Southern States Cooperative employees wearing orange and maroon colors",,"Portraits, Group",,,,"Southern States Cooperative Incorporated",,"Digital Library and Archives, University Libraries, Virginia Tech",,,4/20/2007,,,,,,,"Paul Rossi","Unless otherwise noted, Virginia Tech owns the materials in the Virginia Tech April 16, 2007, Archives of the University Libraries, and retains copyright for the physical and digital materials that comprise the Archives. For further information see http://scholar.lib.vt.edu/prevail/copyright416.html","Unless otherwise noted this resource is available to the public.",,,,,,,,,,,,,,,,,,,,"Still Image",S5L26F0012,,,"Richmond^^Virginia^^United States^^23260",,,,,,,,,,,,,,,,,,,,,,,,,,,,,,,,,,,,,,,,,,,,,,,,,,,,,,,,,,,,,,,,,,,,,,,,,,,,,,,,,http://spec.lib.vt.edu/pickup/Omeka_upload/S5L26F0012.jpg,,"Virginia Tech April 16, 2007 Archives of the University Libraries (MS2008-020)",1,0
6783,https://digitalsc.lib.vt.edu/items/show/6783,"Photograph from employees of Crucial Technology with placards stating ""We -Crucial- Care VT""",,"Portraits, Group",,,,"Crucial Technology",,"Digital Library and Archives, University Libraries, Virginia Tech",,,4/20/2007,,,,,,,"Paul Rossi","Unless otherwise noted, Virginia Tech owns the materials in the Virginia Tech April 16, 2007, Archives of the University Libraries, and retains copyright for the physical and digital materials that comprise the Archives. For further information see http://scholar.lib.vt.edu/prevail/copyright416.html","Unless otherwise noted this resource is available to the public.",,,,,,,,,,,,,,,,,,,,"Still Image",S5L26F0015,,,"Meridian^^Idaho^^United States^^83642",,,,,,,,,,,,,,,,,,,,,,,,,,,,,,,,,,,,,,,,,,,,,,,,,,,,,,,,,,,,,,,,,,,,,,,,,,,,,,,,,http://spec.lib.vt.edu/pickup/Omeka_upload/S5L26F0015.jpg,,"Virginia Tech April 16, 2007 Archives of the University Libraries (MS2008-020)",1,0
6784,https://digitalsc.lib.vt.edu/items/show/6784,"Card with a photograph of Wor-Wic Community College students forming a VT sign",,"Portraits, Group",,,,"Wor-Wic Community College",,"Digital Library and Archives, University Libraries, Virginia Tech",,,4/23/2007,,,,,,,"Paul Rossi","Unless otherwise noted, Virginia Tech owns the materials in the Virginia Tech April 16, 2007, Archives of the University Libraries, and retains copyright for the physical and digital materials that comprise the Archives. For further information see http://scholar.lib.vt.edu/prevail/copyright416.html","Unless otherwise noted this resource is available to the public.",,,,,,,,,,,,,,,,,,,,"Still Image",S5L26F0016,,,"Salisbury^^Maryland^^United States^^21804",,,,,,,,,,,,,,,,,,,,,,,,,,,,,,,,,,,,,,,,,,,,,,,,,,,,,,,,,,,,,,,,,,,,,,,,,,,,,,,,,http://spec.lib.vt.edu/pickup/Omeka_upload/S5L26F0016.jpg,,"Virginia Tech April 16, 2007 Archives of the University Libraries (MS2008-020)",1,0
6785,https://digitalsc.lib.vt.edu/items/show/6785,"Photograph on card showing a flag-raising to half-mast. From Ventura County Council of The Boy Scouts of America",,Photographs,,,,"Boy Scouts of America. Ventura County Council; Witman, Paul",,"Digital Library and Archives, University Libraries, Virginia Tech",,,4/21/2007,,,,,,,"Paul Rossi","Unless otherwise noted, Virginia Tech owns the materials in the Virginia Tech April 16, 2007, Archives of the University Libraries, and retains copyright for the physical and digital materials that comprise the Archives. For further information see http://scholar.lib.vt.edu/prevail/copyright416.html","Unless otherwise noted this resource is available to the public.",,,,,,,,,,,,,,,,,,,,"Still Image",S5L26F0023,,,"Thousand Oaks^^California^^United States^^91360-2700",,,,,,,,,,,,,,,,,,,,,,,,,,,,,,,,,,,,,,,,,,,,,,,,,,,,,,,,,,,,,,,,,,,,,,,,,,,,,,,,,http://spec.lib.vt.edu/pickup/Omeka_upload/S5L26F0023.jpg,,"Virginia Tech April 16, 2007 Archives of the University Libraries (MS2008-020)",1,0
6786,https://digitalsc.lib.vt.edu/items/show/6786,"Photograph fpf Geico employees clapping and holding up a signed vinyl banners at Virginia Beach",,"Portraits, Group",,,,"Geico Insurance",,"Digital Library and Archives, University Libraries, Virginia Tech",,,"c. 2007",,,,,,,"Paul Rossi","Unless otherwise noted, Virginia Tech owns the materials in the Virginia Tech April 16, 2007, Archives of the University Libraries, and retains copyright for the physical and digital materials that comprise the Archives. For further information see http://scholar.lib.vt.edu/prevail/copyright416.html","Unless otherwise noted this resource is available to the public.",,,,,,,,,,,,,,,,,,,,"Still Image",S5L26F0027,,,"Virginia Beach^^Virginia^^United States^^23454",,,,,,,,,,,,,,,,,,,,,,,,,,,,,,,,,,,,,,,,,,,,,,,,,,,,,,,,,,,,,,,,,,,,,,,,,,,,,,,,,http://spec.lib.vt.edu/pickup/Omeka_upload/S5L26F0027.jpg,,"Virginia Tech April 16, 2007 Archives of the University Libraries (MS2008-020)",1,0
6787,https://digitalsc.lib.vt.edu/items/show/6787,"Photograph from Southeast Community College - Lincoln Campus Student Senate representatives planting a tree in memory of VT victims.",,"Portraits, Group^^Tree planting",,,,"Southeast Community College. Lincoln Campus",,"Digital Library and Archives, University Libraries, Virginia Tech",,,5/9/2007,,,,,,,"Paul Rossi","Unless otherwise noted, Virginia Tech owns the materials in the Virginia Tech April 16, 2007, Archives of the University Libraries, and retains copyright for the physical and digital materials that comprise the Archives. For further information see http://scholar.lib.vt.edu/prevail/copyright416.html","Unless otherwise noted this resource is available to the public.",,,,,,,,,,,,,,,,,,,,"Still Image",S5L26F0029,,,"Lincoln^^Nebraska^^United States^^68520-1299",,,,,,,,,,,,,,,,,,,,,,,,,,,,,,,,,,,,,,,,,,,,,,,,,,,,,,,,,,,,,,,,,,,,,,,,,,,,,,,,,http://spec.lib.vt.edu/pickup/Omeka_upload/S5L26F0029.jpg,,"Virginia Tech April 16, 2007 Archives of the University Libraries (MS2008-020)",1,0
6788,https://digitalsc.lib.vt.edu/items/show/6788,"Photograph of Big Sandy Community and Technical College faculty and staff in VT formation",,"Portraits, Group",,,,"Big Sandy Community and Technical College",,"Digital Library and Archives, University Libraries, Virginia Tech",,,7/5/2007,,,,,,,"Vincent Kline","Unless otherwise noted, Virginia Tech owns the materials in the Virginia Tech April 16, 2007, Archives of the University Libraries, and retains copyright for the physical and digital materials that comprise the Archives. For further information see http://scholar.lib.vt.edu/prevail/copyright416.html","Unless otherwise noted this resource is available to the public.",,,,,,,,,,,,,,,,,,,,"Still Image",S5L26F0042,,,"Prestonburg^^Kentucky^^United States^^41653",,,,,,,,,,,,,,,,,,,,,,,,,,,,,,,,,,,,,,,,,,,,,,,,,,,,,,,,,,,,,,,,,,,,,,,,,,,,,,,,,http://spec.lib.vt.edu/pickup/Omeka_upload/S5L26F0042.jpg,,"Virginia Tech April 16, 2007 Archives of the University Libraries (MS2008-020)",1,0
6798,https://digitalsc.lib.vt.edu/items/show/6798,"Picture from City of Niagara Falls Fire Department.",,,"1 Email, 1 printed out picture from City of Niagara Falls Fire Department depicting Niagara Falls lighted with in Virginia Tech colors.",,,"Niagara Falls (N.Y.). Fire Department; MacKay, William    (Fire Chief)",,"Digital Library and Archives, University Libraries, Virginia Tech",,,"c. 2007",,,,,,,"Paul Rossi","Unless otherwise noted, Virginia Tech owns the materials in the Virginia Tech April 16, 2007, Archives of the University Libraries, and retains copyright for the physical and digital materials that comprise the Archives. For further information see http://scholar.lib.vt.edu/prevail/copyright416.html","Unless otherwise noted this resource is available to the public.",,,,,,,,,,,,,,,,,,,,"Still Image",S5L28C2273,,,"Niagara Falls^^New York^^United States",,,,,,,,,,,,,,,,,,,,,,,,,,,,,,,,,,,,,,,,,,,,,,,,,,,,,,,,,,,,,,,,,,,,,,,,,,,,,,,,,http://spec.lib.vt.edu/pickup/Omeka_upload/S5L28C2273.jpg,,"Virginia Tech April 16, 2007 Archives of the University Libraries (MS2008-020)",1,0
6801,https://digitalsc.lib.vt.edu/items/show/6801,"Photograph of military group in formation of VT in front of barracks.",,"Portraits, Group",,,,,,"Digital Library and Archives, University Libraries, Virginia Tech",,,"c. 2007",,,,,,,"Paul Rossi","Unless otherwise noted, Virginia Tech owns the materials in the Virginia Tech April 16, 2007, Archives of the University Libraries, and retains copyright for the physical and digital materials that comprise the Archives. For further information see http://scholar.lib.vt.edu/prevail/copyright416.html","Unless otherwise noted this resource is available to the public.",,,,,,,,,,,,,,,,,,,,"Still Image",S5L29F0048,,,,,,,,,,,,,,,,,,,,,,,,,,,,,,,,,,,,,,,,,,,,,,,,,,,,,,,,,,,,,,,,,,,,,,,,,,,,,,,,,,,,http://spec.lib.vt.edu/pickup/Omeka_upload/S5L29F0048.jpg,,"Virginia Tech April 16, 2007 Archives of the University Libraries (MS2008-020)",1,0
6809,https://digitalsc.lib.vt.edu/items/show/6809,"Photograph of Farm Fresh Food and Pharmacy employees",,"Portraits, Group",,,,"Farm Fresh Food and Pharmacy",,"Digital Library and Archives, University Libraries, Virginia Tech",,,6/6/2007,,,,,,,"Paul Rossi","Unless otherwise noted, Virginia Tech owns the materials in the Virginia Tech April 16, 2007, Archives of the University Libraries, and retains copyright for the physical and digital materials that comprise the Archives. For further information see http://scholar.lib.vt.edu/prevail/copyright416.html","Unless otherwise noted this resource is available to the public.",,,,,,,,,,,,,,,,,,,,"Still Image",S5L33F0072,,,"Virginia Beach^^Virginia^^United States^^23452-3049",,,,,,,,,,,,,,,,,,,,,,,,,,,,,,,,,,,,,,,,,,,,,,,,,,,,,,,,,,,,,,,,,,,,,,,,,,,,,,,,,http://spec.lib.vt.edu/pickup/Omeka_upload/S5L33F0072.jpg,,"Virginia Tech April 16, 2007 Archives of the University Libraries (MS2008-020)",1,0
6810,https://digitalsc.lib.vt.edu/items/show/6810,"Photograph of General Dynamics Information Technology employees",,"Portraits, Group",,,,"General Dynamics Information Technology",,"Digital Library and Archives, University Libraries, Virginia Tech",,,"c. 2007",,,,,,,"Paul Rossi","Unless otherwise noted, Virginia Tech owns the materials in the Virginia Tech April 16, 2007, Archives of the University Libraries, and retains copyright for the physical and digital materials that comprise the Archives. For further information see http://scholar.lib.vt.edu/prevail/copyright416.html","Unless otherwise noted this resource is available to the public.",,,,,,,,,,,,,,,,,,,,"Still Image",S5L33F0074,,,"Chesapeake^^Virginia^^United States^^23320",,,,,,,,,,,,,,,,,,,,,,,,,,,,,,,,,,,,,,,,,,,,,,,,,,,,,,,,,,,,,,,,,,,,,,,,,,,,,,,,,http://spec.lib.vt.edu/pickup/Omeka_upload/S5L33F0074.jpg,,"Virginia Tech April 16, 2007 Archives of the University Libraries (MS2008-020)",1,0
6812,https://digitalsc.lib.vt.edu/items/show/6812,"Photograph and letter from Angela Singleton Vaughan",,"Fund raising",,,,"Vaughan, Angela  Singleton",,"Digital Library and Archives, University Libraries, Virginia Tech",,,6/28/2007,,,,,,,"Paul Rossi","Unless otherwise noted, Virginia Tech owns the materials in the Virginia Tech April 16, 2007, Archives of the University Libraries, and retains copyright for the physical and digital materials that comprise the Archives. For further information see http://scholar.lib.vt.edu/prevail/copyright416.html","Unless otherwise noted this resource is available to the public.",,,,,,,,,,,,,,,,,,,,"Still Image",S5L37F0057,,,"Roanoke^^Virginia^^United States^^24015",,,,,,,,,,,,,,,,,,,,,,,,,,,,,,,,,,,,,,,,,,,,,,,,,,,,,,,,,,,,,,,,,,,,,,,,,,,,,,,,,http://spec.lib.vt.edu/pickup/Omeka_upload/S5L37F0057.jpg,,"Virginia Tech April 16, 2007 Archives of the University Libraries (MS2008-020)",1,0
6813,https://digitalsc.lib.vt.edu/items/show/6813,"Photographs of a student and placard from the  University of North Carolina at Wilmington",,,,,,"University of North Carolina at Wilmington",,"Digital Library and Archives, University Libraries, Virginia Tech",,,4/20/2007,,,,,,,"Paul Rossi","Unless otherwise noted, Virginia Tech owns the materials in the Virginia Tech April 16, 2007, Archives of the University Libraries, and retains copyright for the physical and digital materials that comprise the Archives. For further information see http://scholar.lib.vt.edu/prevail/copyright416.html","Unless otherwise noted this resource is available to the public.",,,,,,,,,,,,,,,,,,,,"Still Image",S5L37F0064,,,"Wilmington^^North Carolina^^United States^^28403-5931",,,,,,,,,,,,,,,,,,,,,,,,,,,,,,,,,,,,,,,,,,,,,,,,,,,,,,,,,,,,,,,,,,,,,,,,,,,,,,,,,http://spec.lib.vt.edu/pickup/Omeka_upload/S5L37F0064.jpg,,"Virginia Tech April 16, 2007 Archives of the University Libraries (MS2008-020)",1,0
6829,https://digitalsc.lib.vt.edu/items/show/6829,"Photograph of Aurora Flight Sciences employees with signatures",,"Portraits, Group",,,,"Aurora Flight Sciences",,"Digital Library and Archives, University Libraries, Virginia Tech",,,"c. 2007",,,,,,,"Paul Rossi","Unless otherwise noted, Virginia Tech owns the materials in the Virginia Tech April 16, 2007, Archives of the University Libraries, and retains copyright for the physical and digital materials that comprise the Archives. For further information see http://scholar.lib.vt.edu/prevail/copyright416.html","Unless otherwise noted this resource is available to the public.",,,,,,,,,,,,,,,,,,,,"Still Image",S5L41F0088,,,"Manassas^^Virginia^^United States^^20110",,,,,,,,,,,,,,,,,,,,,,,,,,,,,,,,,,,,,,,,,,,,,,,,,,,,,,,,,,,,,,,,,,,,,,,,,,,,,,,,,http://spec.lib.vt.edu/pickup/Omeka_upload/S5L41F0088.jpg,,"Virginia Tech April 16, 2007 Archives of the University Libraries (MS2008-020)",1,0