﻿"Item Id","Item URI","Dublin Core:Title","Dublin Core:Alternative Title","Dublin Core:Subject","Dublin Core:Description","Dublin Core:Abstract","Dublin Core:Table Of Contents","Dublin Core:Creator","Dublin Core:Source","Dublin Core:Publisher","Dublin Core:Date","Dublin Core:Date Available","Dublin Core:Date Created","Dublin Core:Date Accepted","Dublin Core:Date Copyrighted","Dublin Core:Date Submitted","Dublin Core:Date Issued","Dublin Core:Date Modified","Dublin Core:Date Valid","Dublin Core:Contributor","Dublin Core:Rights","Dublin Core:Access Rights","Dublin Core:License","Dublin Core:Relation","Dublin Core:Conforms To","Dublin Core:Has Format","Dublin Core:Has Part","Dublin Core:Has Version","Dublin Core:Is Format Of","Dublin Core:Is Part Of","Dublin Core:Is Referenced By","Dublin Core:Is Replaced By","Dublin Core:Is Required By","Dublin Core:Is Version Of","Dublin Core:References","Dublin Core:Replaces","Dublin Core:Requires","Dublin Core:Format","Dublin Core:Extent","Dublin Core:Medium","Dublin Core:Language","Dublin Core:Type","Dublin Core:Identifier","Dublin Core:Bibliographic Citation","Dublin Core:Coverage","Dublin Core:Spatial Coverage","Dublin Core:Temporal Coverage","Dublin Core:Accrual Method","Dublin Core:Accrual Periodicity","Dublin Core:Accrual Policy","Dublin Core:Audience","Dublin Core:Audience Education Level","Dublin Core:Mediator","Dublin Core:Instructional Method","Dublin Core:Provenance","Dublin Core:Rights Holder","Item Type Metadata:Text","Item Type Metadata:Interviewer","Item Type Metadata:Interviewee","Item Type Metadata:Location","Item Type Metadata:Transcription","Item Type Metadata:Local URL","Item Type Metadata:Original Format","Item Type Metadata:Physical Dimensions","Item Type Metadata:Duration","Item Type Metadata:Compression","Item Type Metadata:Producer","Item Type Metadata:Director","Item Type Metadata:Bit Rate/Frequency","Item Type Metadata:Time Summary","Item Type Metadata:Email Body","Item Type Metadata:Subject Line","Item Type Metadata:From","Item Type Metadata:To","Item Type Metadata:CC","Item Type Metadata:BCC","Item Type Metadata:Number of Attachments","Item Type Metadata:Standards","Item Type Metadata:Objectives","Item Type Metadata:Materials","Item Type Metadata:Lesson Plan Text","Item Type Metadata:URL","Item Type Metadata:Event Type","Item Type Metadata:Participants","Item Type Metadata:Birth Date","Item Type Metadata:Birthplace","Item Type Metadata:Death Date","Item Type Metadata:Occupation","Item Type Metadata:Biographical Text","Item Type Metadata:Bibliography","Item Type Metadata:Transcript","Item Type Metadata:Viewer","Item Type Metadata:Narrator","Item Type Metadata:Production Team","Item Type Metadata:Display Resolution","Item Type Metadata:Frame Rate","Item Type Metadata:Player","Omeka Legacy File:Additional Creator","Omeka Legacy File:Transcriber","Omeka Legacy File:Producer","Omeka Legacy File:Render Device","Omeka Legacy File:Render Details","Omeka Legacy File:Capture Date","Omeka Legacy File:Capture Device","Omeka Legacy File:Capture Details","Omeka Legacy File:Change History","Omeka Legacy File:Watermark","Omeka Legacy File:Encryption","Omeka Legacy File:Compression","Omeka Legacy File:Post Processing","Omeka Image File:Width","Omeka Image File:Height","Omeka Image File:Bit Depth","Omeka Image File:Channels","Omeka Image File:Exif String","Omeka Image File:Exif Array","Omeka Image File:IPTC String","Omeka Image File:IPTC Array","Omeka Video File:Bitrate","Omeka Video File:Duration","Omeka Video File:Sample Rate","Omeka Video File:Codec","Omeka Video File:Width","Omeka Video File:Height","PDF Text:Text",tags,file,itemType,collection,public,featured
18306,https://digitalsc.lib.vt.edu/items/show/18306,"Papers of Dr. H. G. Carter (Ms2019-009)",,,"This document includes different papers published between 1920 and 1926 by Dr. Harry Gilmore Carter, who was the Superintendent and Medical Director of Piedmont Sanatorium. His papers includes information about the running of Piedmont and understanding Tuberculosis.",,,"Carter, H. G. (Harry Gilmore), 1886-1926","<a href=""https://ead.lib.virginia.edu/vivaxtf/view?docId=oai/lib.vt.edu/repositories/2/resources/3334.oai_ead.xml"">See the finding aid for the Piedmont Tuberculosis Sanatorium (Burkeville, Virginia) Collection.</a>",,undated,,,,,,,,,,"This Item is protected by copyright and/or related rights. However, for this Item, either (a) no rights-holder(s) have been identified or (b) one or more rights-holder(s) have been identified but none have been located. You are free to use this Item in any way that is permitted by the copyright and related rights legislation that applies to your use. <a href=""https://rightsstatements.org/page/InC-RUU/1.0/?language=en"">https://rightsstatements.org/page/InC-RUU/1.0/?language=en</a>",,,,,,,,,"Ms2019-009, Box 1, Folder 4",,,,,,,,,,,English,"Alternative publications",Ms2019_009_B01F04_PapersOfDrHGCarter_undated,"Researchers wishing to cite this collection should include the following information: Piedmont Tuberculosis Sanatorium (Burkeville, Virginia) Collection, Ms2019-009, Special Collections, Virginia Tech, Blacksburg, Va.",,,,,,,,,,,,"Special Collections and University Archives, Virginia Tech",,,,,,,,,,,,,,,,,,,,,,,,,,,,,,,,,,,,,,,,,,,,,,,,,,,,,,,,,,,,,,,,,,,,,,,https://digitalsc.lib.vt.edu/files/original/e00de3b8280ebe8eed3b0b5daa365baf.pdf,Document,"Piedmont Tuberculosis Sanatorium (Burkeville, Virginia) Collection",1,0
2796,https://digitalsc.lib.vt.edu/items/show/2796,"Alice, Volume 7, No. 2, February 6, 1970",,"University History^^Blacksburg (Va.)",,,,"Blacksburg Free Press","<a href=""http://addison.vt.edu/record=b1456388~S5#.VAi7BGMgvsc"">View the library catalog record for Alice</a>","Blacksburg Free Press",2/6/1970,,,,,,,,,,"<a href=""https://omeka.lib.vt.edu/files/thumbnails/spec_forms/PubPermission.doc"">Permission to publish material from Alice must be obtained from Special Collections, Virginia Tech.</a>",,,,,,,,,,,,,,,,,,,,,"Alternative publications",alice_v7n2,,,,,,,,,,,,,"<a href=""http://spec.lib.vt.edu/"">Special Collections, University Libraries, Virginia Tech</a>",,,,,,,,,,,,,,,,,,,,,,,,,,,,,,,,,,,,,,,,,,,,,,,,,,,,,,,,,,,,,,,,,,,,,,,"https://digitalsc.lib.vt.edu/files/original/Alice/alice_v7n2/alice_v7n2_pg001.jpg,https://digitalsc.lib.vt.edu/files/original/Alice/alice_v7n2/alice_v7n2_pg002.jpg,https://digitalsc.lib.vt.edu/files/original/Alice/alice_v7n2/alice_v7n2_pg003.jpg,https://digitalsc.lib.vt.edu/files/original/Alice/alice_v7n2/alice_v7n2_pg004.jpg,https://digitalsc.lib.vt.edu/files/original/Alice/alice_v7n2/alice_v7n2_pg005.jpg,https://digitalsc.lib.vt.edu/files/original/Alice/alice_v7n2/alice_v7n2_pg006.jpg,https://digitalsc.lib.vt.edu/files/original/Alice/alice_v7n2/alice_v7n2_pg007.jpg,https://digitalsc.lib.vt.edu/files/original/Alice/alice_v7n2/alice_v7n2_pg008-009.jpg,https://digitalsc.lib.vt.edu/files/original/Alice/alice_v7n2/alice_v7n2_pg010.jpg,https://digitalsc.lib.vt.edu/files/original/Alice/alice_v7n2/alice_v7n2_pg011.jpg,https://digitalsc.lib.vt.edu/files/original/Alice/alice_v7n2/alice_v7n2_pg012.jpg,https://digitalsc.lib.vt.edu/files/original/Alice/alice_v7n2/alice_v7n2_pg013.jpg,https://digitalsc.lib.vt.edu/files/original/Alice/alice_v7n2/alice_v7n2_pg014.jpg,https://digitalsc.lib.vt.edu/files/original/Alice/alice_v7n2/alice_v7n2_pg015.jpg,https://digitalsc.lib.vt.edu/files/original/Alice/alice_v7n2/alice_v7n2_pg016.jpg",Document,Alice,1,0
2801,https://digitalsc.lib.vt.edu/items/show/2801,"Alice, Volume 8, No. 2, May, 1970",,"Blacksburg (Va.)^^University History",,,,"Blacksburg Free Press","<a href=""http://addison.vt.edu/record=b1456388~S5#.VAi7BGMgvsc"">View the library catalog record for Alice</a>","Blacksburg Free Press",1970-05,,,,,,,,,,"<a href=""https://omeka.lib.vt.edu/files/thumbnails/spec_forms/PubPermission.doc"">Permission to publish material from Alice must be obtained from Special Collections, Virginia Tech.</a>",,,,,,,,,,,,,,,,,,,,,"Alternative publications",alice_v8n2,,,,,,,,,,,,,"<a href=""http://spec.lib.vt.edu/"">Special Collections, University Libraries, Virginia Tech</a>",,,,,,,,,,,,,,,,,,,,,,,,,,,,,,,,,,,,,,,,,,,,,,,,,,,,,,,,,,,,,,,,,,,,,,,"https://digitalsc.lib.vt.edu/files/original/Alice/alice_v8n2/alice_v8n2_pg001.jpg,https://digitalsc.lib.vt.edu/files/original/Alice/alice_v8n2/alice_v8n2_pg002.jpg,https://digitalsc.lib.vt.edu/files/original/Alice/alice_v8n2/alice_v8n2_pg003.jpg,https://digitalsc.lib.vt.edu/files/original/Alice/alice_v8n2/alice_v8n2_pg004.jpg,https://digitalsc.lib.vt.edu/files/original/Alice/alice_v8n2/alice_v8n2_pg005.jpg,https://digitalsc.lib.vt.edu/files/original/Alice/alice_v8n2/alice_v8n2_pg006-007.jpg,https://digitalsc.lib.vt.edu/files/original/Alice/alice_v8n2/alice_v8n2_pg008.jpg,https://digitalsc.lib.vt.edu/files/original/Alice/alice_v8n2/alice_v8n2_pg009.jpg,https://digitalsc.lib.vt.edu/files/original/Alice/alice_v8n2/alice_v8n2_pg010.jpg,https://digitalsc.lib.vt.edu/files/original/Alice/alice_v8n2/alice_v8n2_pg011.jpg,https://digitalsc.lib.vt.edu/files/original/Alice/alice_v8n2/alice_v8n2_pg012.jpg",Document,Alice,1,0
2798,https://digitalsc.lib.vt.edu/items/show/2798,"Alice, Volume 8, No. 1, April, 1970",,"University History^^Blacksburg (Va.)",,,,"Blacksburg Free Press","<a href=""http://addison.vt.edu/record=b1456388~S5#.VAi7BGMgvsc"">View the library catalog record for Alice</a>","Blacksburg Free Press",1970-04,,,,,,,,,,"<a href=""https://omeka.lib.vt.edu/files/thumbnails/spec_forms/PubPermission.doc"">Permission to publish material from Alice must be obtained from Special Collections, Virginia Tech.</a>",,,,,,,,,,,,,,,,,,,,,"Alternative publications",alice_v8n1,,,,,,,,,,,,,"<a href=""http://spec.lib.vt.edu/"">Special Collections, University Libraries, Virginia Tech</a>",,,,,,,,,,,,,,,,,,,,,,,,,,,,,,,,,,,,,,,,,,,,,,,,,,,,,,,,,,,,,,,,,,,,,,,"https://digitalsc.lib.vt.edu/files/original/Alice/alice_v8n1/alice_v8n1_pg002.jpg,https://digitalsc.lib.vt.edu/files/original/Alice/alice_v8n1/alice_v8n1_pg003.jpg,https://digitalsc.lib.vt.edu/files/original/Alice/alice_v8n1/alice_v8n1_pg004.jpg,https://digitalsc.lib.vt.edu/files/original/Alice/alice_v8n1/alice_v8n1_pg005.jpg,https://digitalsc.lib.vt.edu/files/original/Alice/alice_v8n1/alice_v8n1_pg006-007.jpg,https://digitalsc.lib.vt.edu/files/original/Alice/alice_v8n1/alice_v8n1_pg008.jpg,https://digitalsc.lib.vt.edu/files/original/Alice/alice_v8n1/alice_v8n1_pg009.jpg,https://digitalsc.lib.vt.edu/files/original/Alice/alice_v8n1/alice_v8n1_pg010.jpg,https://digitalsc.lib.vt.edu/files/original/Alice/alice_v8n1/alice_v8n1_pg011.jpg,https://digitalsc.lib.vt.edu/files/original/Alice/alice_v8n1/alice_v8n1_pg012.jpg,https://digitalsc.lib.vt.edu/files/original/Alice/alice_v8n1/alice_v8n1_pg001.jpg",Document,Alice,1,0
2797,https://digitalsc.lib.vt.edu/items/show/2797,"Alice, Volume 7, No. 3, March, 1970",,"University History^^Blacksburg (Va.)",,,,"Blacksburg Free Press","<a href=""http://addison.vt.edu/record=b1456388~S5#.VAi7BGMgvsc"">View the library catalog record for Alice</a>","Blacksburg Free Press",1970-03,,,,,,,,,,"<a href=""https://omeka.lib.vt.edu/files/thumbnails/spec_forms/PubPermission.doc"">Permission to publish material from Alice must be obtained from Special Collections, Virginia Tech.</a>",,,,,,,,,,,,,,,,,,,,,"Alternative publications",alice_v7n3,,,,,,,,,,,,,"<a href=""http://spec.lib.vt.edu/"">Special Collections, University Libraries, Virginia Tech</a>",,,,,,,,,,,,,,,,,,,,,,,,,,,,,,,,,,,,,,,,,,,,,,,,,,,,,,,,,,,,,,,,,,,,,,,"https://digitalsc.lib.vt.edu/files/original/Alice/alice_v7n3/alice_v7n3_insert1_crop.jpg,https://digitalsc.lib.vt.edu/files/original/Alice/alice_v7n3/alice_v7n3_insert2_crop.jpg,https://digitalsc.lib.vt.edu/files/original/Alice/alice_v7n3/alice_v7n3_pg001.jpg,https://digitalsc.lib.vt.edu/files/original/Alice/alice_v7n3/alice_v7n3_pg002.jpg,https://digitalsc.lib.vt.edu/files/original/Alice/alice_v7n3/alice_v7n3_pg003.jpg,https://digitalsc.lib.vt.edu/files/original/Alice/alice_v7n3/alice_v7n3_pg005.jpg,https://digitalsc.lib.vt.edu/files/original/Alice/alice_v7n3/alice_v7n3_pg006-007.jpg,https://digitalsc.lib.vt.edu/files/original/Alice/alice_v7n3/alice_v7n3_pg008.jpg,https://digitalsc.lib.vt.edu/files/original/Alice/alice_v7n3/alice_v7n3_pg009.jpg,https://digitalsc.lib.vt.edu/files/original/Alice/alice_v7n3/alice_v7n3_pg010.jpg,https://digitalsc.lib.vt.edu/files/original/Alice/alice_v7n3/alice_v7n3_pg011.jpg,https://digitalsc.lib.vt.edu/files/original/Alice/alice_v7n3/alice_v7n3_pg012.jpg",Document,Alice,1,0
2795,https://digitalsc.lib.vt.edu/items/show/2795,"Alice, Volume 7, No. 1, January, 1970",,"University History^^Blacksburg (Va.)",,,,"Blacksburg Free Press","<a href=""http://addison.vt.edu/record=b1456388~S5#.VAi7BGMgvsc"">View the library catalog record for Alice</a>","Blacksburg Free Press",1970-01,,,,,,,,,,"<a href=""https://omeka.lib.vt.edu/files/thumbnails/spec_forms/PubPermission.doc"">Permission to publish material from Alice must be obtained from Special Collections, Virginia Tech.</a>",,,,,,,,,,,,,,,,,,,,,"Alternative publications",alice_v7n1,,,,,,,,,,,,,"<a href=""http://spec.lib.vt.edu/"">Special Collections, University Libraries, Virginia Tech</a>",,,,,,,,,,,,,,,,,,,,,,,,,,,,,,,,,,,,,,,,,,,,,,,,,,,,,,,,,,,,,,,,,,,,,,,"https://digitalsc.lib.vt.edu/files/original/Alice/alice_v7n1/alice_v7n1_pg001.jpg,https://digitalsc.lib.vt.edu/files/original/Alice/alice_v7n1/alice_v7n1_pg002.jpg,https://digitalsc.lib.vt.edu/files/original/Alice/alice_v7n1/alice_v7n1_pg003.jpg,https://digitalsc.lib.vt.edu/files/original/Alice/alice_v7n1/alice_v7n1_pg004.jpg,https://digitalsc.lib.vt.edu/files/original/Alice/alice_v7n1/alice_v7n1_pg005.jpg,https://digitalsc.lib.vt.edu/files/original/Alice/alice_v7n1/alice_v7n1_pg006.jpg,https://digitalsc.lib.vt.edu/files/original/Alice/alice_v7n1/alice_v7n1_pg007.jpg,https://digitalsc.lib.vt.edu/files/original/Alice/alice_v7n1/alice_v7n1_pg008.jpg",Document,Alice,1,0
2794,https://digitalsc.lib.vt.edu/items/show/2794,"Alice, Volume 6, No. 3, October, 1969",,"University History^^Blacksburg (Va.)",,,,"Blacksburg Free Press","<a href=""http://addison.vt.edu/record=b1456388~S5#.VAi7BGMgvsc"">View the library catalog record for Alice</a>","Blacksburg Free Press",1969-10,,,,,,,,,,"<a href=""https://omeka.lib.vt.edu/files/thumbnails/spec_forms/PubPermission.doc"">Permission to publish material from Alice must be obtained from Special Collections, Virginia Tech.</a>",,,,,,,,,,,,,,,,,,,,,"Alternative publications",alice_v6n3,,,,,,,,,,,,,"<a href=""http://spec.lib.vt.edu/"">Special Collections, University Libraries, Virginia Tech</a>",,,,,,,,,,,,,,,,,,,,,,,,,,,,,,,,,,,,,,,,,,,,,,,,,,,,,,,,,,,,,,,,,,,,,,,"https://digitalsc.lib.vt.edu/files/original/Alice/alice_v6n3/alice_v6n3_pg001.jpg,https://digitalsc.lib.vt.edu/files/original/Alice/alice_v6n3/alice_v6n3_pg002.jpg,https://digitalsc.lib.vt.edu/files/original/Alice/alice_v6n3/alice_v6n3_pg003.jpg,https://digitalsc.lib.vt.edu/files/original/Alice/alice_v6n3/alice_v6n3_pg004.jpg,https://digitalsc.lib.vt.edu/files/original/Alice/alice_v6n3/alice_v6n3_pg005.jpg,https://digitalsc.lib.vt.edu/files/original/Alice/alice_v6n3/alice_v6n3_pg006.jpg,https://digitalsc.lib.vt.edu/files/original/Alice/alice_v6n3/alice_v6n3_pg007.jpg,https://digitalsc.lib.vt.edu/files/original/Alice/alice_v6n3/alice_v6n3_pg008-009.jpg,https://digitalsc.lib.vt.edu/files/original/Alice/alice_v6n3/alice_v6n3_pg010.jpg,https://digitalsc.lib.vt.edu/files/original/Alice/alice_v6n3/alice_v6n3_pg011.jpg,https://digitalsc.lib.vt.edu/files/original/Alice/alice_v6n3/alice_v6n3_pg012.jpg,https://digitalsc.lib.vt.edu/files/original/Alice/alice_v6n3/alice_v6n3_pg013.jpg,https://digitalsc.lib.vt.edu/files/original/Alice/alice_v6n3/alice_v6n3_pg014.jpg,https://digitalsc.lib.vt.edu/files/original/Alice/alice_v6n3/alice_v6n3_pg015.jpg,https://digitalsc.lib.vt.edu/files/original/Alice/alice_v6n3/alice_v6n3_pg016.jpg",Document,Alice,1,0
2792,https://digitalsc.lib.vt.edu/items/show/2792,"Alice, Volume 6, No. 2, October, 1969",,"University History^^Blacksburg (Va.)",,,,"Blacksburg Free Press","<a href=""http://addison.vt.edu/record=b1456388~S5#.VAi7BGMgvsc"">View the library catalog record for Alice</a>","Blacksburg Free Press",1969-10,,,,,,,,,,"<a href=""https://omeka.lib.vt.edu/files/thumbnails/spec_forms/PubPermission.doc"">Permission to publish material from Alice must be obtained from Special Collections, Virginia Tech.</a>",,,,,,,,,,,,,,,,,,,,,"Alternative publications",alice_v6n2,,,,,,,,,,,,,"<a href=""http://spec.lib.vt.edu/"">Special Collections, University Libraries, Virginia Tech</a>",,,,,,,,,,,,,,,,,,,,,,,,,,,,,,,,,,,,,,,,,,,,,,,,,,,,,,,,,,,,,,,,,,,,,,,"https://digitalsc.lib.vt.edu/files/original/Alice/alice_v6n2/alice_v6n2_pg001.jpg,https://digitalsc.lib.vt.edu/files/original/Alice/alice_v6n2/alice_v6n2_pg002.jpg,https://digitalsc.lib.vt.edu/files/original/Alice/alice_v6n2/alice_v6n2_pg003.jpg,https://digitalsc.lib.vt.edu/files/original/Alice/alice_v6n2/alice_v6n2_pg004.jpg,https://digitalsc.lib.vt.edu/files/original/Alice/alice_v6n2/alice_v6n2_pg005.jpg,https://digitalsc.lib.vt.edu/files/original/Alice/alice_v6n2/alice_v6n2_pg006.jpg,https://digitalsc.lib.vt.edu/files/original/Alice/alice_v6n2/alice_v6n2_pg007.jpg,https://digitalsc.lib.vt.edu/files/original/Alice/alice_v6n2/alice_v6n2_pg008.jpg,https://digitalsc.lib.vt.edu/files/original/Alice/alice_v6n2/alice_v6n2_pg009.jpg,https://digitalsc.lib.vt.edu/files/original/Alice/alice_v6n2/alice_v6n2_pg010.jpg,https://digitalsc.lib.vt.edu/files/original/Alice/alice_v6n2/alice_v6n2_pg011.jpg,https://digitalsc.lib.vt.edu/files/original/Alice/alice_v6n2/alice_v6n2_pg012.jpg,https://digitalsc.lib.vt.edu/files/original/Alice/alice_v6n2/alice_v6n2_pg013.jpg,https://digitalsc.lib.vt.edu/files/original/Alice/alice_v6n2/alice_v6n2_pg014.jpg,https://digitalsc.lib.vt.edu/files/original/Alice/alice_v6n2/alice_v6n2_pg015.jpg,https://digitalsc.lib.vt.edu/files/original/Alice/alice_v6n2/alice_v6n2_pg016.jpg,https://digitalsc.lib.vt.edu/files/original/Alice/alice_v6n2/alice_v6n2_pg017.jpg,https://digitalsc.lib.vt.edu/files/original/Alice/alice_v6n2/alice_v6n2_pg018.jpg,https://digitalsc.lib.vt.edu/files/original/Alice/alice_v6n2/alice_v6n2_pg019.jpg,https://digitalsc.lib.vt.edu/files/original/Alice/alice_v6n2/alice_v6n2_pg020.jpg",Document,Alice,1,0
2791,https://digitalsc.lib.vt.edu/items/show/2791,"Alice, Volume 6, No. 1, September, 1969",,"University History^^Blacksburg (Va.)",,,,"Blacksburg Free Press","<a href=""http://addison.vt.edu/record=b1456388~S5#.VAi7BGMgvsc"">View the library catalog record for Alice</a>","Blacksburg Free Press",1969-09,,,,,,,,,,"<a href=""https://omeka.lib.vt.edu/files/thumbnails/spec_forms/PubPermission.doc"">Permission to publish material from Alice must be obtained from Special Collections, Virginia Tech.</a>",,,,,,,,,,,,,,,,,,,,,"Alternative publications",alice_v6n1,,,,,,,,,,,,,"<a href=""http://spec.lib.vt.edu/"">Special Collections, University Libraries, Virginia Tech</a>",,,,,,,,,,,,,,,,,,,,,,,,,,,,,,,,,,,,,,,,,,,,,,,,,,,,,,,,,,,,,,,,,,,,,,,"https://digitalsc.lib.vt.edu/files/original/Alice/alice_v6n1/alice_v6n1_pg001.jpg,https://digitalsc.lib.vt.edu/files/original/Alice/alice_v6n1/alice_v6n1_pg002.jpg,https://digitalsc.lib.vt.edu/files/original/Alice/alice_v6n1/alice_v6n1_pg003.jpg,https://digitalsc.lib.vt.edu/files/original/Alice/alice_v6n1/alice_v6n1_pg004.jpg,https://digitalsc.lib.vt.edu/files/original/Alice/alice_v6n1/alice_v6n1_pg005.jpg,https://digitalsc.lib.vt.edu/files/original/Alice/alice_v6n1/alice_v6n1_pg006.jpg,https://digitalsc.lib.vt.edu/files/original/Alice/alice_v6n1/alice_v6n1_pg007.jpg,https://digitalsc.lib.vt.edu/files/original/Alice/alice_v6n1/alice_v6n1_pg008-009.jpg,https://digitalsc.lib.vt.edu/files/original/Alice/alice_v6n1/alice_v6n1_pg010.jpg,https://digitalsc.lib.vt.edu/files/original/Alice/alice_v6n1/alice_v6n1_pg011.jpg,https://digitalsc.lib.vt.edu/files/original/Alice/alice_v6n1/alice_v6n1_pg012.jpg,https://digitalsc.lib.vt.edu/files/original/Alice/alice_v6n1/alice_v6n1_pg013.jpg,https://digitalsc.lib.vt.edu/files/original/Alice/alice_v6n1/alice_v6n1_pg014.jpg,https://digitalsc.lib.vt.edu/files/original/Alice/alice_v6n1/alice_v6n1_pg015.jpg,https://digitalsc.lib.vt.edu/files/original/Alice/alice_v6n1/alice_v6n1_pg016.jpg",Document,Alice,1,0
2730,https://digitalsc.lib.vt.edu/items/show/2730,"Alice, Volume 5, No. 5, May 20, 1969",,"University History^^Blacksburg (Va.)",,,,"Blacksburg Free Press","<a href=""http://addison.vt.edu/record=b1456388~S5#.VAi7BGMgvsc"">View the library catalog record for Alice</a>","Blacksburg Free Press",1969-05-20,,,,,,,,,,"<a href=""https://omeka.lib.vt.edu/files/thumbnails/spec_forms/PubPermission.doc"">Permission to publish material from Alice must be obtained from Special Collections, Virginia Tech.</a>",,,,,,,,,,,,,,,,,,,,English,"Alternative publications",alice_v5n5,,,,,,,,,,,,,"<a href=""http://spec.lib.vt.edu/"">Special Collections, University Libraries, Virginia Tech</a>",,,,,,,,,,,,,,,,,,,,,,,,,,,,,,,,,,,,,,,,,,,,,,,,,,,,,,,,,,,,,,,,,,,,,,,"https://digitalsc.lib.vt.edu/files/original/f0ac3f71a162e309025b314526b1146d.jpg,https://digitalsc.lib.vt.edu/files/original/78e9b0c91c95c06cb4c773e6cee317c4.jpg,https://digitalsc.lib.vt.edu/files/original/ea769461827121a2f7ea8bf69a3bdd5e.jpg,https://digitalsc.lib.vt.edu/files/original/57c4fe330b5e4f8d6e9f14e6e7678136.jpg,https://digitalsc.lib.vt.edu/files/original/5a3df0d058947b80e1a19c5a465a5e36.jpg,https://digitalsc.lib.vt.edu/files/original/956aa61e50c015e62fda5462d3ad6226.jpg,https://digitalsc.lib.vt.edu/files/original/e06ba1abf0a9bdf7da1ae61a31569fcf.jpg,https://digitalsc.lib.vt.edu/files/original/43f64c2a9c088abba13a428b40542041.jpg,https://digitalsc.lib.vt.edu/files/original/0918b65f34ce367fb8d65852cdd34b0b.jpg,https://digitalsc.lib.vt.edu/files/original/e0e218627ed170ba719c09d6ad23e3d6.jpg,https://digitalsc.lib.vt.edu/files/original/98189a3d3b87e4de06746f329b3746b7.jpg,https://digitalsc.lib.vt.edu/files/original/131108e2b421c7263af8da8b6c59eb91.jpg,https://digitalsc.lib.vt.edu/files/original/0caab7dd956d609d52ed1442000da57f.jpg,https://digitalsc.lib.vt.edu/files/original/3caa1ee062833dc6ea922a7818fab82c.jpg,https://digitalsc.lib.vt.edu/files/original/72e10c39ab7578151ebba2a57fbb4c18.jpg",Document,Alice,1,0
2729,https://digitalsc.lib.vt.edu/items/show/2729,"Alice, Volume 5, No. 4, May 1, 1969",,"University History^^Blacksburg (Va.)",,,,"Blacksburg Free Press","<a href=""http://addison.vt.edu/record=b1456388~S5#.VAi7BGMgvsc"">View the library catalog record for Alice</a>","Blacksburg Free Press",1969-05-01,,,,,,,,,,"<a href=""https://omeka.lib.vt.edu/files/thumbnails/spec_forms/PubPermission.doc"">Permission to publish material from Alice must be obtained from Special Collections, Virginia Tech.</a>",,,,,,,,,,,,,,,,,,,,English,"Alternative publications",alice_v5n4,,,,,,,,,,,,,"<a href=""http://spec.lib.vt.edu/"">Special Collections, University Libraries, Virginia Tech</a>",,,,,,,,,,,,,,,,,,,,,,,,,,,,,,,,,,,,,,,,,,,,,,,,,,,,,,,,,,,,,,,,,,,,,,,"https://digitalsc.lib.vt.edu/files/original/9c9229131b3b53c7be843153d8b02b0b.jpg,https://digitalsc.lib.vt.edu/files/original/38b0598f1a9f1e11fc205b80238bb8ac.jpg,https://digitalsc.lib.vt.edu/files/original/cb81e026eb89d4b0ae26a8b787523d8c.jpg,https://digitalsc.lib.vt.edu/files/original/0bb3e0d7da2e8e7944f1ef2030f7e458.jpg,https://digitalsc.lib.vt.edu/files/original/3ab5cf3ae5787c8afbd3088872f7ec58.jpg,https://digitalsc.lib.vt.edu/files/original/916320eb14f3195f3e5fb2d8dc62f80e.jpg,https://digitalsc.lib.vt.edu/files/original/9df68e36de3e1abedfb65a057b8b0063.jpg",Document,Alice,1,0