﻿"Item Id","Item URI","Dublin Core:Title","Dublin Core:Alternative Title","Dublin Core:Subject","Dublin Core:Description","Dublin Core:Abstract","Dublin Core:Table Of Contents","Dublin Core:Creator","Dublin Core:Source","Dublin Core:Publisher","Dublin Core:Date","Dublin Core:Date Available","Dublin Core:Date Created","Dublin Core:Date Accepted","Dublin Core:Date Copyrighted","Dublin Core:Date Submitted","Dublin Core:Date Issued","Dublin Core:Date Modified","Dublin Core:Date Valid","Dublin Core:Contributor","Dublin Core:Rights","Dublin Core:Access Rights","Dublin Core:License","Dublin Core:Relation","Dublin Core:Conforms To","Dublin Core:Has Format","Dublin Core:Has Part","Dublin Core:Has Version","Dublin Core:Is Format Of","Dublin Core:Is Part Of","Dublin Core:Is Referenced By","Dublin Core:Is Replaced By","Dublin Core:Is Required By","Dublin Core:Is Version Of","Dublin Core:References","Dublin Core:Replaces","Dublin Core:Requires","Dublin Core:Format","Dublin Core:Extent","Dublin Core:Medium","Dublin Core:Language","Dublin Core:Type","Dublin Core:Identifier","Dublin Core:Bibliographic Citation","Dublin Core:Coverage","Dublin Core:Spatial Coverage","Dublin Core:Temporal Coverage","Dublin Core:Accrual Method","Dublin Core:Accrual Periodicity","Dublin Core:Accrual Policy","Dublin Core:Audience","Dublin Core:Audience Education Level","Dublin Core:Mediator","Dublin Core:Instructional Method","Dublin Core:Provenance","Dublin Core:Rights Holder","Item Type Metadata:Text","Item Type Metadata:Interviewer","Item Type Metadata:Interviewee","Item Type Metadata:Location","Item Type Metadata:Transcription","Item Type Metadata:Local URL","Item Type Metadata:Original Format","Item Type Metadata:Physical Dimensions","Item Type Metadata:Duration","Item Type Metadata:Compression","Item Type Metadata:Producer","Item Type Metadata:Director","Item Type Metadata:Bit Rate/Frequency","Item Type Metadata:Time Summary","Item Type Metadata:Email Body","Item Type Metadata:Subject Line","Item Type Metadata:From","Item Type Metadata:To","Item Type Metadata:CC","Item Type Metadata:BCC","Item Type Metadata:Number of Attachments","Item Type Metadata:Standards","Item Type Metadata:Objectives","Item Type Metadata:Materials","Item Type Metadata:Lesson Plan Text","Item Type Metadata:URL","Item Type Metadata:Event Type","Item Type Metadata:Participants","Item Type Metadata:Birth Date","Item Type Metadata:Birthplace","Item Type Metadata:Death Date","Item Type Metadata:Occupation","Item Type Metadata:Biographical Text","Item Type Metadata:Bibliography","Item Type Metadata:Transcript","Item Type Metadata:Viewer","Item Type Metadata:Player","Item Type Metadata:Frame Rate","Item Type Metadata:Display Resolution","Item Type Metadata:Production Team","Item Type Metadata:Narrator","Omeka Legacy File:Additional Creator","Omeka Legacy File:Transcriber","Omeka Legacy File:Producer","Omeka Legacy File:Render Device","Omeka Legacy File:Render Details","Omeka Legacy File:Capture Date","Omeka Legacy File:Capture Device","Omeka Legacy File:Capture Details","Omeka Legacy File:Change History","Omeka Legacy File:Watermark","Omeka Legacy File:Encryption","Omeka Legacy File:Compression","Omeka Legacy File:Post Processing","Omeka Image File:Width","Omeka Image File:Height","Omeka Image File:Bit Depth","Omeka Image File:Channels","Omeka Image File:Exif String","Omeka Image File:Exif Array","Omeka Image File:IPTC String","Omeka Image File:IPTC Array","Omeka Video File:Bitrate","Omeka Video File:Duration","Omeka Video File:Sample Rate","Omeka Video File:Codec","Omeka Video File:Width","Omeka Video File:Height","PDF Text:Text",tags,file,itemType,collection,public,featured
6827,https://digitalsc.lib.vt.edu/items/show/6827,"Letter from the Patriarch of Jerusalem",,,,,,,,"Digital Library and Archives, University Libraries, Virginia Tech",,,4/20/2007,,,,,,,"Paul Rossi","Unless otherwise noted, Virginia Tech owns the materials in the Virginia Tech April 16, 2007, Archives of the University Libraries, and retains copyright for the physical and digital materials that comprise the Archives. For further information see http://scholar.lib.vt.edu/prevail/copyright416.html","Unless otherwise noted this resource is available to the public.",,,,,,,,,,,,,,,,,,,,Document,S5L41C2524,,,Jerusalem,,,,,,,,,,,,,,,,,,,,,,,,,,,,,,,,,,,,,,,,,,,,,,,,,,,,,,,,,,,,,,,,,,,,,,,,,,,,,,,,,http://spec.lib.vt.edu/pickup/Omeka_upload/S5L41C2524.jpg,,"Virginia Tech April 16, 2007 Archives of the University Libraries (MS2008-020)",1,0
6813,https://digitalsc.lib.vt.edu/items/show/6813,"Photographs of a student and placard from the  University of North Carolina at Wilmington",,,,,,"University of North Carolina at Wilmington",,"Digital Library and Archives, University Libraries, Virginia Tech",,,4/20/2007,,,,,,,"Paul Rossi","Unless otherwise noted, Virginia Tech owns the materials in the Virginia Tech April 16, 2007, Archives of the University Libraries, and retains copyright for the physical and digital materials that comprise the Archives. For further information see http://scholar.lib.vt.edu/prevail/copyright416.html","Unless otherwise noted this resource is available to the public.",,,,,,,,,,,,,,,,,,,,"Still Image",S5L37F0064,,,"Wilmington^^North Carolina^^United States^^28403-5931",,,,,,,,,,,,,,,,,,,,,,,,,,,,,,,,,,,,,,,,,,,,,,,,,,,,,,,,,,,,,,,,,,,,,,,,,,,,,,,,,http://spec.lib.vt.edu/pickup/Omeka_upload/S5L37F0064.jpg,,"Virginia Tech April 16, 2007 Archives of the University Libraries (MS2008-020)",1,0
6783,https://digitalsc.lib.vt.edu/items/show/6783,"Photograph from employees of Crucial Technology with placards stating ""We -Crucial- Care VT""",,"Portraits, Group",,,,"Crucial Technology",,"Digital Library and Archives, University Libraries, Virginia Tech",,,4/20/2007,,,,,,,"Paul Rossi","Unless otherwise noted, Virginia Tech owns the materials in the Virginia Tech April 16, 2007, Archives of the University Libraries, and retains copyright for the physical and digital materials that comprise the Archives. For further information see http://scholar.lib.vt.edu/prevail/copyright416.html","Unless otherwise noted this resource is available to the public.",,,,,,,,,,,,,,,,,,,,"Still Image",S5L26F0015,,,"Meridian^^Idaho^^United States^^83642",,,,,,,,,,,,,,,,,,,,,,,,,,,,,,,,,,,,,,,,,,,,,,,,,,,,,,,,,,,,,,,,,,,,,,,,,,,,,,,,,http://spec.lib.vt.edu/pickup/Omeka_upload/S5L26F0015.jpg,,"Virginia Tech April 16, 2007 Archives of the University Libraries (MS2008-020)",1,0
6782,https://digitalsc.lib.vt.edu/items/show/6782,"Photograph of Southern States Cooperative employees wearing orange and maroon colors",,"Portraits, Group",,,,"Southern States Cooperative Incorporated",,"Digital Library and Archives, University Libraries, Virginia Tech",,,4/20/2007,,,,,,,"Paul Rossi","Unless otherwise noted, Virginia Tech owns the materials in the Virginia Tech April 16, 2007, Archives of the University Libraries, and retains copyright for the physical and digital materials that comprise the Archives. For further information see http://scholar.lib.vt.edu/prevail/copyright416.html","Unless otherwise noted this resource is available to the public.",,,,,,,,,,,,,,,,,,,,"Still Image",S5L26F0012,,,"Richmond^^Virginia^^United States^^23260",,,,,,,,,,,,,,,,,,,,,,,,,,,,,,,,,,,,,,,,,,,,,,,,,,,,,,,,,,,,,,,,,,,,,,,,,,,,,,,,,http://spec.lib.vt.edu/pickup/Omeka_upload/S5L26F0012.jpg,,"Virginia Tech April 16, 2007 Archives of the University Libraries (MS2008-020)",1,0
6779,https://digitalsc.lib.vt.edu/items/show/6779,"Photograph of Musselman Middle School students forming a large VT sign and a letter from Principal",,"Portraits, Group",,,,"Musselman Middle School",,"Digital Library and Archives, University Libraries, Virginia Tech",,,4/20/2007,,,,,,,"Paul Rossi","Unless otherwise noted, Virginia Tech owns the materials in the Virginia Tech April 16, 2007, Archives of the University Libraries, and retains copyright for the physical and digital materials that comprise the Archives. For further information see http://scholar.lib.vt.edu/prevail/copyright416.html","Unless otherwise noted this resource is available to the public.",,,,,,,,,,,,,,,,,,,,"Still Image",S5L26F0001,,,"Bunker Hill^^West Virginia^^United States^^25413",,,,,,,,,,,,,,,,,,,,,,,,,,,,,,,,,,,,,,,,,,,,,,,,,,,,,,,,,,,,,,,,,,,,,,,,,,,,,,,,,http://spec.lib.vt.edu/pickup/Omeka_upload/S5L26F0001.jpg,,"Virginia Tech April 16, 2007 Archives of the University Libraries (MS2008-020)",1,0
6750,https://digitalsc.lib.vt.edu/items/show/6750,"Letter from Alpha Sigma Tau",,,,,,"Alpha Sigma Tau",,"Digital Library and Archives, University Libraries, Virginia Tech",,,4/20/2007,,,,,,,"Paul Rossi","Unless otherwise noted, Virginia Tech owns the materials in the Virginia Tech April 16, 2007, Archives of the University Libraries, and retains copyright for the physical and digital materials that comprise the Archives. For further information see http://scholar.lib.vt.edu/prevail/copyright416.html","Unless otherwise noted this resource is available to the public.",,,,,,,,,,,,,,,,,,,,Document,S5L17C1524,,,"Dexter^^Michigan^^United States^^48130",,,,,,,,,,,,,,,,,,,,,,,,,,,,,,,,,,,,,,,,,,,,,,,,,,,,,,,,,,,,,,,,,,,,,,,,,,,,,,,,,http://spec.lib.vt.edu/pickup/Omeka_upload/S5L17C1524.jpg,,"Virginia Tech April 16, 2007 Archives of the University Libraries (MS2008-020)",1,0
6744,https://digitalsc.lib.vt.edu/items/show/6744,"Letter and photograph from Sun Trust Bank Education Loans",,,,,,"SunTrust Bank. Education Loans",,"Digital Library and Archives, University Libraries, Virginia Tech",,,4/20/2007,,,,,,,"Paul Rossi","Unless otherwise noted, Virginia Tech owns the materials in the Virginia Tech April 16, 2007, Archives of the University Libraries, and retains copyright for the physical and digital materials that comprise the Archives. For further information see http://scholar.lib.vt.edu/prevail/copyright416.html","Unless otherwise noted this resource is available to the public.",,,,,,,,,,,,,,,,,,,,"Document^^Still Image",S5L15C2199,,,"Richmond^^Virginia^^United States^^23224",,,,,,,,,,,,,,,,,,,,,,,,,,,,,,,,,,,,,,,,,,,,,,,,,,,,,,,,,,,,,,,,,,,,,,,,,,,,,,,,,http://spec.lib.vt.edu/pickup/Omeka_upload/S5L15C2199.jpg,,"Virginia Tech April 16, 2007 Archives of the University Libraries (MS2008-020)",1,0
6738,https://digitalsc.lib.vt.edu/items/show/6738,"Letters and photograph from Cincinnati Christian High Schools",,,,,,"Cincinnati Christian High Schools",,"Digital Library and Archives, University Libraries, Virginia Tech",,,4/20/2007,,,,,,,"Alex Grizzard","Unless otherwise noted, Virginia Tech owns the materials in the Virginia Tech April 16, 2007, Archives of the University Libraries, and retains copyright for the physical and digital materials that comprise the Archives. For further information see http://scholar.lib.vt.edu/prevail/copyright416.html","Unless otherwise noted this resource is available to the public.",,,,,,,,,,,,,,,,,,,,"Document^^Still Image",S4L6C0461,,,"Fairfield^^Ohio^^United States^^45014",,,,,,,,,,,,,,,,,,,,,,,,,,,,,,,,,,,,,,,,,,,,,,,,,,,,,,,,,,,,,,,,,,,,,,,,,,,,,,,,,http://spec.lib.vt.edu/pickup/Omeka_upload/S4L6C0461.jpg,,"Virginia Tech April 16, 2007 Archives of the University Libraries (MS2008-020)",1,0
6733,https://digitalsc.lib.vt.edu/items/show/6733,"Photographs and note from Sparrow Road International School",,,,,,"Sparrow Road International School",,"Digital Library and Archives, University Libraries, Virginia Tech",,,4/20/2007,,,,,,,"Alex Grizzard","Unless otherwise noted, Virginia Tech owns the materials in the Virginia Tech April 16, 2007, Archives of the University Libraries, and retains copyright for the physical and digital materials that comprise the Archives. For further information see http://scholar.lib.vt.edu/prevail/copyright416.html","Unless otherwise noted this resource is available to the public.",,,,,,,,,,,,,,,,,,,,"Document^^Still Image",S4L5C0242,,,"Chesapeake^^Virginia^^United States^^23325",,,,,,,,,,,,,,,,,,,,,,,,,,,,,,,,,,,,,,,,,,,,,,,,,,,,,,,,,,,,,,,,,,,,,,,,,,,,,,,,,http://spec.lib.vt.edu/pickup/Omeka_upload/S4L5C0242.jpg,,"Virginia Tech April 16, 2007 Archives of the University Libraries (MS2008-020)",1,0
6732,https://digitalsc.lib.vt.edu/items/show/6732,"Letters from Christ the King Regional High School",,,,,,"Christ the King Regional High School",,"Digital Library and Archives, University Libraries, Virginia Tech",,,4/20/2007,,,,,,,"Alex Grizzard","Unless otherwise noted, Virginia Tech owns the materials in the Virginia Tech April 16, 2007, Archives of the University Libraries, and retains copyright for the physical and digital materials that comprise the Archives. For further information see http://scholar.lib.vt.edu/prevail/copyright416.html","Unless otherwise noted this resource is available to the public.",,,,,,,,,,,,,,,,,,,,Document,S4L5C0240,,,"Middle Village^^New York^^United States^^11379",,,,,,,,,,,,,,,,,,,,,,,,,,,,,,,,,,,,,,,,,,,,,,,,,,,,,,,,,,,,,,,,,,,,,,,,,,,,,,,,,http://spec.lib.vt.edu/pickup/Omeka_upload/S4L5C0240.jpg,,"Virginia Tech April 16, 2007 Archives of the University Libraries (MS2008-020)",1,0
6731,https://digitalsc.lib.vt.edu/items/show/6731,"Letters from Doig Intermediate School",,,,,,"Doig Intermediate School",,"Digital Library and Archives, University Libraries, Virginia Tech",,,4/20/2007,,,,,,,"Alex Grizzard","Unless otherwise noted, Virginia Tech owns the materials in the Virginia Tech April 16, 2007, Archives of the University Libraries, and retains copyright for the physical and digital materials that comprise the Archives. For further information see http://scholar.lib.vt.edu/prevail/copyright416.html","Unless otherwise noted this resource is available to the public.",,,,,,,,,,,,,,,,,,,,Document,S4L5C0237,,,"Garden Grove^^California^^United States^^92843",,,,,,,,,,,,,,,,,,,,,,,,,,,,,,,,,,,,,,,,,,,,,,,,,,,,,,,,,,,,,,,,,,,,,,,,,,,,,,,,,http://spec.lib.vt.edu/pickup/Omeka_upload/S4L5C0237.jpg,,"Virginia Tech April 16, 2007 Archives of the University Libraries (MS2008-020)",1,0
6710,https://digitalsc.lib.vt.edu/items/show/6710,"Photograph from Union County Magnet High School",,,,,,"Union County Magnet High School",,"Digital Library and Archives, University Libraries, Virginia Tech",,,4/20/2007,,,,,,,"Alex Grizzard","Unless otherwise noted, Virginia Tech owns the materials in the Virginia Tech April 16, 2007, Archives of the University Libraries, and retains copyright for the physical and digital materials that comprise the Archives. For further information see http://scholar.lib.vt.edu/prevail/copyright416.html","Unless otherwise noted this resource is available to the public.",,,,,,,,,,,,,,,,,,,,"Still Image",S4L1C0083,,,"Scotch Plains^^New Jersey^^United States^^07076-2997",,,,,,,,,,,,,,,,,,,,,,,,,,,,,,,,,,,,,,,,,,,,,,,,,,,,,,,,,,,,,,,,,,,,,,,,,,,,,,,,,http://spec.lib.vt.edu/pickup/Omeka_upload/S4L1C0083.jpg,,"Virginia Tech April 16, 2007 Archives of the University Libraries (MS2008-020)",1,0
