﻿"Item Id","Item URI","Dublin Core:Title","Dublin Core:Alternative Title","Dublin Core:Subject","Dublin Core:Description","Dublin Core:Abstract","Dublin Core:Table Of Contents","Dublin Core:Creator","Dublin Core:Source","Dublin Core:Publisher","Dublin Core:Date","Dublin Core:Date Available","Dublin Core:Date Created","Dublin Core:Date Accepted","Dublin Core:Date Copyrighted","Dublin Core:Date Submitted","Dublin Core:Date Issued","Dublin Core:Date Modified","Dublin Core:Date Valid","Dublin Core:Contributor","Dublin Core:Rights","Dublin Core:Access Rights","Dublin Core:License","Dublin Core:Relation","Dublin Core:Conforms To","Dublin Core:Has Format","Dublin Core:Has Part","Dublin Core:Has Version","Dublin Core:Is Format Of","Dublin Core:Is Part Of","Dublin Core:Is Referenced By","Dublin Core:Is Replaced By","Dublin Core:Is Required By","Dublin Core:Is Version Of","Dublin Core:References","Dublin Core:Replaces","Dublin Core:Requires","Dublin Core:Format","Dublin Core:Extent","Dublin Core:Medium","Dublin Core:Language","Dublin Core:Type","Dublin Core:Identifier","Dublin Core:Bibliographic Citation","Dublin Core:Coverage","Dublin Core:Spatial Coverage","Dublin Core:Temporal Coverage","Dublin Core:Accrual Method","Dublin Core:Accrual Periodicity","Dublin Core:Accrual Policy","Dublin Core:Audience","Dublin Core:Audience Education Level","Dublin Core:Mediator","Dublin Core:Instructional Method","Dublin Core:Provenance","Dublin Core:Rights Holder","Item Type Metadata:Text","Item Type Metadata:Interviewer","Item Type Metadata:Interviewee","Item Type Metadata:Location","Item Type Metadata:Transcription","Item Type Metadata:Local URL","Item Type Metadata:Original Format","Item Type Metadata:Physical Dimensions","Item Type Metadata:Duration","Item Type Metadata:Compression","Item Type Metadata:Producer","Item Type Metadata:Director","Item Type Metadata:Bit Rate/Frequency","Item Type Metadata:Time Summary","Item Type Metadata:Email Body","Item Type Metadata:Subject Line","Item Type Metadata:From","Item Type Metadata:To","Item Type Metadata:CC","Item Type Metadata:BCC","Item Type Metadata:Number of Attachments","Item Type Metadata:Standards","Item Type Metadata:Objectives","Item Type Metadata:Materials","Item Type Metadata:Lesson Plan Text","Item Type Metadata:URL","Item Type Metadata:Event Type","Item Type Metadata:Participants","Item Type Metadata:Birth Date","Item Type Metadata:Birthplace","Item Type Metadata:Death Date","Item Type Metadata:Occupation","Item Type Metadata:Biographical Text","Item Type Metadata:Bibliography","Item Type Metadata:Transcript","Item Type Metadata:Viewer","Item Type Metadata:Player","Item Type Metadata:Frame Rate","Item Type Metadata:Display Resolution","Item Type Metadata:Production Team","Item Type Metadata:Narrator","Omeka Legacy File:Additional Creator","Omeka Legacy File:Transcriber","Omeka Legacy File:Producer","Omeka Legacy File:Render Device","Omeka Legacy File:Render Details","Omeka Legacy File:Capture Date","Omeka Legacy File:Capture Device","Omeka Legacy File:Capture Details","Omeka Legacy File:Change History","Omeka Legacy File:Watermark","Omeka Legacy File:Encryption","Omeka Legacy File:Compression","Omeka Legacy File:Post Processing","Omeka Image File:Width","Omeka Image File:Height","Omeka Image File:Bit Depth","Omeka Image File:Channels","Omeka Image File:Exif String","Omeka Image File:Exif Array","Omeka Image File:IPTC String","Omeka Image File:IPTC Array","Omeka Video File:Bitrate","Omeka Video File:Duration","Omeka Video File:Sample Rate","Omeka Video File:Codec","Omeka Video File:Width","Omeka Video File:Height","PDF Text:Text",tags,file,itemType,collection,public,featured
23857,https://digitalsc.lib.vt.edu/items/show/23857,"Photograph Of An Older Woman",,"Local/Regional History and Appalachian South^^Montgomery County (Va.)^^Photographs","Photograph Of An Older Woman",,,"Palmer, Earl, 1905-1996","<a href=""https://ead.lib.virginia.edu/vivaxtf/view?docId=oai/VT/repositories_2_resources_1652.xml&amp;chunk.id=&amp;toc.depth=1&amp;toc.id=&amp;brand=default"">See the finding aid for the Earl Palmer Appalachian Photograph and Artifact Collection</a>",,1940s-1970s,,,,,,,,,,"This Item is protected by copyright and/or related rights. You are free to use this Item in any way that is permitted by the copyright and related rights legislation that applies to your use. In addition, no permission is required from the rights-holder(s) for educational uses. For other uses, you need to obtain permission from the rights-holder(s). <a target=""_blank"" href=""https://rightsstatements.org/page/InC-EDU/1.0/?language=en"" rel=""noreferrer noopener"">https://rightsstatements.org/page/InC-EDU/1.0/</a>",,,,,,,,,Ms1989-025,,,,,,,,tiff,,,"No script-based materials.",Photographs,ep505,"Researchers wishing to cite this collection should include the following information: [identification of item], [box], [folder], Earl Palmer Appalachian Photograph and Artifact Collection, Ms1989-025, Special Collections and University Archives, Virginia Tech, Blacksburg, Va.",,,,,,,,,,,,"Special Collections and University Archives, Virginia Tech",,,,,,,,,,,,,,,,,,,,,,,,,,,,,,,,,,,,,,,,,,,,,,,,,,,,,,,,,,,,,,,,,,,,,,,https://digitalsc.lib.vt.edu/files/original/5c433980a9d229064e4c8b2670e7289b.tiff,"Still Image","Earl Palmer Appalachian Photograph and Artifact Collection, 1880-1989 (Ms1989-025)",1,0
12691,https://digitalsc.lib.vt.edu/items/show/12691,"Pickaxe head (metal)",,"Solitude (Blacksburg, Va.: Historic building)^^Blacksburg (Va.)^^Montgomery County (Va.)^^Local/Regional History and Appalachian South^^Virginia Polytechnic Institute and State University^^University History","Color image.",,,,"<a target=""_blank"" href=""https://ead.lib.virginia.edu/vivaxtf/view?docId=oai/VT/repositories_2_resources_1652.xml&chunk.id=&toc.depth=1&toc.id=&brand=default"">See the finding aid for the Earl Palmer Appalachian Photograph and Artifact Collection.</a>",,,,,,,,,,,,"This Item is protected by copyright and/or related rights. You are free to use this Item in any way that is permitted by the copyright and related rights legislation that applies to your use. In addition, no permission is required from the rights-holder(s) for non-commercial uses. For other uses you need to obtain permission from the rights-holder(s). <a href=""https://rightsstatements.org/page/InC-NC/1.0/?language=en"" target=""_blank"" rel=""noreferrer noopener"">https://rightsstatements.org/page/InC-NC/1.0/?language=en</a>",,,,,,,,,"Earl Palmer Appalachian Photograph and Artifact Collection, 1880-1989 (Ms1989-025)",,,,,,,,image/jpg,,,"No language or script-based material",Photographs,SOLITUDE0012,"[item description], Earl Palmer Appalachian Photograph and Artifact Collection, 1880-1989 (Ms1989-025), Special Collections and University Archives, Virginia Tech. ",,,,,,,,,,,,"Special Collections and University Archives, Virginia Tech",,,,,,,,,,,,,,,,,,,,,,,,,,,,,,,,,,,,,,,,,,,,,,,,,,,,,,,,,,,,,,,,,,,,,,,https://digitalsc.lib.vt.edu/files/original/8a7b86c75c3e11872518466ade4c0384.jpg,"Still Image","Earl Palmer Appalachian Photograph and Artifact Collection, 1880-1989 (Ms1989-025)",1,0
23640,https://digitalsc.lib.vt.edu/items/show/23640,"Picking Apples",,"Local/Regional History and Appalachian South^^Montgomery County (Va.)^^Photographs","Picking Apples",,,"Palmer, Earl, 1905-1996","<a href=""https://ead.lib.virginia.edu/vivaxtf/view?docId=oai/VT/repositories_2_resources_1652.xml&amp;chunk.id=&amp;toc.depth=1&amp;toc.id=&amp;brand=default"">See the finding aid for the Earl Palmer Appalachian Photograph and Artifact Collection</a>",,1940s-1970s,,,,,,,,,,"This Item is protected by copyright and/or related rights. You are free to use this Item in any way that is permitted by the copyright and related rights legislation that applies to your use. In addition, no permission is required from the rights-holder(s) for educational uses. For other uses, you need to obtain permission from the rights-holder(s). <a target=""_blank"" href=""https://rightsstatements.org/page/InC-EDU/1.0/?language=en"" rel=""noreferrer noopener"">https://rightsstatements.org/page/InC-EDU/1.0/</a>",,,,,,,,,Ms1989-025,,,,,,,,tiff,,,"No script-based materials.",Photographs,ep288,"Researchers wishing to cite this collection should include the following information: [identification of item], [box], [folder], Earl Palmer Appalachian Photograph and Artifact Collection, Ms1989-025, Special Collections and University Archives, Virginia Tech, Blacksburg, Va.",,,,,,,,,,,,"Special Collections and University Archives, Virginia Tech",,,,,,,,,,,,,,,,,,,,,,,,,,,,,,,,,,,,,,,,,,,,,,,,,,,,,,,,,,,,,,,,,,,,,,,https://digitalsc.lib.vt.edu/files/original/2ed129a039aa60a51926fc73ce41fc29.tiff,"Still Image","Earl Palmer Appalachian Photograph and Artifact Collection, 1880-1989 (Ms1989-025)",1,0
23649,https://digitalsc.lib.vt.edu/items/show/23649,"Picnic area on the Blue Ridge Parkway",,"Local/Regional History and Appalachian South^^Montgomery County (Va.)^^Photographs","Picnic area on the Blue Ridge Parkway",,,"Palmer, Earl, 1905-1996","<a href=""https://ead.lib.virginia.edu/vivaxtf/view?docId=oai/VT/repositories_2_resources_1652.xml&amp;chunk.id=&amp;toc.depth=1&amp;toc.id=&amp;brand=default"">See the finding aid for the Earl Palmer Appalachian Photograph and Artifact Collection</a>",,1940s-1970s,,,,,,,,,,"This Item is protected by copyright and/or related rights. You are free to use this Item in any way that is permitted by the copyright and related rights legislation that applies to your use. In addition, no permission is required from the rights-holder(s) for educational uses. For other uses, you need to obtain permission from the rights-holder(s). <a target=""_blank"" href=""https://rightsstatements.org/page/InC-EDU/1.0/?language=en"" rel=""noreferrer noopener"">https://rightsstatements.org/page/InC-EDU/1.0/</a>",,,,,,,,,Ms1989-025,,,,,,,,tiff,,,"No script-based materials.",Photographs,ep297,"Researchers wishing to cite this collection should include the following information: [identification of item], [box], [folder], Earl Palmer Appalachian Photograph and Artifact Collection, Ms1989-025, Special Collections and University Archives, Virginia Tech, Blacksburg, Va.",,,,,,,,,,,,"Special Collections and University Archives, Virginia Tech",,,,,,,,,,,,,,,,,,,,,,,,,,,,,,,,,,,,,,,,,,,,,,,,,,,,,,,,,,,,,,,,,,,,,,,https://digitalsc.lib.vt.edu/files/original/7f2a5d415f47d6e38b8be0ef6afd35a4.tiff,"Still Image","Earl Palmer Appalachian Photograph and Artifact Collection, 1880-1989 (Ms1989-025)",1,0
23493,https://digitalsc.lib.vt.edu/items/show/23493,"Piece of Slate With Imprint of a Fern",,"Local/Regional History and Appalachian South^^Montgomery County (Va.)^^Photographs","Piece of Slate With Imprint of a Fern",,,"Palmer, Earl, 1905-1996","<a href=""https://ead.lib.virginia.edu/vivaxtf/view?docId=oai/VT/repositories_2_resources_1652.xml&amp;chunk.id=&amp;toc.depth=1&amp;toc.id=&amp;brand=default"">See the finding aid for the Earl Palmer Appalachian Photograph and Artifact Collection</a>",,1940s-1970s,,,,,,,,,,"This Item is protected by copyright and/or related rights. You are free to use this Item in any way that is permitted by the copyright and related rights legislation that applies to your use. In addition, no permission is required from the rights-holder(s) for educational uses. For other uses, you need to obtain permission from the rights-holder(s). <a target=""_blank"" href=""https://rightsstatements.org/page/InC-EDU/1.0/?language=en"" rel=""noreferrer noopener"">https://rightsstatements.org/page/InC-EDU/1.0/</a>",,,,,,,,,Ms1989-025,,,,,,,,tiff,,,"No script-based materials.",Photographs,ep141,"Researchers wishing to cite this collection should include the following information: [identification of item], [box], [folder], Earl Palmer Appalachian Photograph and Artifact Collection, Ms1989-025, Special Collections and University Archives, Virginia Tech, Blacksburg, Va.",,,,,,,,,,,,"Special Collections and University Archives, Virginia Tech",,,,,,,,,,,,,,,,,,,,,,,,,,,,,,,,,,,,,,,,,,,,,,,,,,,,,,,,,,,,,,,,,,,,,,,https://digitalsc.lib.vt.edu/files/original/0cfbad9a15a182d402ab9db91788ca90.tiff,"Still Image","Earl Palmer Appalachian Photograph and Artifact Collection, 1880-1989 (Ms1989-025)",1,0
12681,https://digitalsc.lib.vt.edu/items/show/12681,"Pig, cornstalk carving",,"Solitude (Blacksburg, Va.: Historic building)^^Blacksburg (Va.)^^Montgomery County (Va.)^^Local/Regional History and Appalachian South^^Virginia Polytechnic Institute and State University^^University History","Color image.",,,,"<a target=""_blank"" href=""https://ead.lib.virginia.edu/vivaxtf/view?docId=oai/VT/repositories_2_resources_1652.xml&chunk.id=&toc.depth=1&toc.id=&brand=default"">See the finding aid for the Earl Palmer Appalachian Photograph and Artifact Collection.</a>",,,,,,,,,,,,"This Item is protected by copyright and/or related rights. You are free to use this Item in any way that is permitted by the copyright and related rights legislation that applies to your use. In addition, no permission is required from the rights-holder(s) for non-commercial uses. For other uses you need to obtain permission from the rights-holder(s). <a href=""https://rightsstatements.org/page/InC-NC/1.0/?language=en"" target=""_blank"" rel=""noreferrer noopener"">https://rightsstatements.org/page/InC-NC/1.0/?language=en</a>",,,,,,,,,"Earl Palmer Appalachian Photograph and Artifact Collection, 1880-1989 (Ms1989-025)",,,,,,,,image/jpg,,,"No language or script-based material",Photographs,SOLITUDE0070,"[item description], Earl Palmer Appalachian Photograph and Artifact Collection, 1880-1989 (Ms1989-025), Special Collections and University Archives, Virginia Tech. ",,,,,,,,,,,,"Special Collections and University Archives, Virginia Tech",,,,,,,,,,,,,,,,,,,,,,,,,,,,,,,,,,,,,,,,,,,,,,,,,,,,,,,,,,,,,,,,,,,,,,,https://digitalsc.lib.vt.edu/files/original/48b5b9f0ba4044f074cd6cc7c53a108f.jpg,"Still Image","Earl Palmer Appalachian Photograph and Artifact Collection, 1880-1989 (Ms1989-025)",1,0
23829,https://digitalsc.lib.vt.edu/items/show/23829,"Pine Mountain State Park",,"Local/Regional History and Appalachian South^^Montgomery County (Va.)^^Photographs","Pine Mountain State Park",,,"Palmer, Earl, 1905-1996","<a href=""https://ead.lib.virginia.edu/vivaxtf/view?docId=oai/VT/repositories_2_resources_1652.xml&amp;chunk.id=&amp;toc.depth=1&amp;toc.id=&amp;brand=default"">See the finding aid for the Earl Palmer Appalachian Photograph and Artifact Collection</a>",,1940s-1970s,,,,,,,,,,"This Item is protected by copyright and/or related rights. You are free to use this Item in any way that is permitted by the copyright and related rights legislation that applies to your use. In addition, no permission is required from the rights-holder(s) for educational uses. For other uses, you need to obtain permission from the rights-holder(s). <a target=""_blank"" href=""https://rightsstatements.org/page/InC-EDU/1.0/?language=en"" rel=""noreferrer noopener"">https://rightsstatements.org/page/InC-EDU/1.0/</a>",,,,,,,,,Ms1989-025,,,,,,,,tiff,,,"No script-based materials.",Photographs,ep477,"Researchers wishing to cite this collection should include the following information: [identification of item], [box], [folder], Earl Palmer Appalachian Photograph and Artifact Collection, Ms1989-025, Special Collections and University Archives, Virginia Tech, Blacksburg, Va.",,,,,,,,,,,,"Special Collections and University Archives, Virginia Tech",,,,,,,,,,,,,,,,,,,,,,,,,,,,,,,,,,,,,,,,,,,,,,,,,,,,,,,,,,,,,,,,,,,,,,,https://digitalsc.lib.vt.edu/files/original/ac48dde50a52faa8096f19030ba474e0.tiff,"Still Image","Earl Palmer Appalachian Photograph and Artifact Collection, 1880-1989 (Ms1989-025)",1,0
23666,https://digitalsc.lib.vt.edu/items/show/23666,"Pine Mountian Settlement School students playing tether ball",,"Local/Regional History and Appalachian South^^Montgomery County (Va.)^^Photographs","Pine Mountian Settlement School students playing tether ball",,,"Palmer, Earl, 1905-1996","<a href=""https://ead.lib.virginia.edu/vivaxtf/view?docId=oai/VT/repositories_2_resources_1652.xml&amp;chunk.id=&amp;toc.depth=1&amp;toc.id=&amp;brand=default"">See the finding aid for the Earl Palmer Appalachian Photograph and Artifact Collection</a>",,1940s-1970s,,,,,,,,,,"This Item is protected by copyright and/or related rights. You are free to use this Item in any way that is permitted by the copyright and related rights legislation that applies to your use. In addition, no permission is required from the rights-holder(s) for educational uses. For other uses, you need to obtain permission from the rights-holder(s). <a target=""_blank"" href=""https://rightsstatements.org/page/InC-EDU/1.0/?language=en"" rel=""noreferrer noopener"">https://rightsstatements.org/page/InC-EDU/1.0/</a>",,,,,,,,,Ms1989-025,,,,,,,,tiff,,,"No script-based materials.",Photographs,ep314,"Researchers wishing to cite this collection should include the following information: [identification of item], [box], [folder], Earl Palmer Appalachian Photograph and Artifact Collection, Ms1989-025, Special Collections and University Archives, Virginia Tech, Blacksburg, Va.",,,,,,,,,,,,"Special Collections and University Archives, Virginia Tech",,,,,,,,,,,,,,,,,,,,,,,,,,,,,,,,,,,,,,,,,,,,,,,,,,,,,,,,,,,,,,,,,,,,,,,https://digitalsc.lib.vt.edu/files/original/d625b66c685cc7a213f78a5347bf752f.tiff,"Still Image","Earl Palmer Appalachian Photograph and Artifact Collection, 1880-1989 (Ms1989-025)",1,0
23834,https://digitalsc.lib.vt.edu/items/show/23834,"Pipe Organ in Pine Mountain Settlement School",,"Local/Regional History and Appalachian South^^Montgomery County (Va.)^^Photographs","Pipe Organ in Pine Mountain Settlement School",,,"Palmer, Earl, 1905-1996","<a href=""https://ead.lib.virginia.edu/vivaxtf/view?docId=oai/VT/repositories_2_resources_1652.xml&amp;chunk.id=&amp;toc.depth=1&amp;toc.id=&amp;brand=default"">See the finding aid for the Earl Palmer Appalachian Photograph and Artifact Collection</a>",,1940s-1970s,,,,,,,,,,"This Item is protected by copyright and/or related rights. You are free to use this Item in any way that is permitted by the copyright and related rights legislation that applies to your use. In addition, no permission is required from the rights-holder(s) for educational uses. For other uses, you need to obtain permission from the rights-holder(s). <a target=""_blank"" href=""https://rightsstatements.org/page/InC-EDU/1.0/?language=en"" rel=""noreferrer noopener"">https://rightsstatements.org/page/InC-EDU/1.0/</a>",,,,,,,,,Ms1989-025,,,,,,,,tiff,,,"No script-based materials.",Photographs,ep482,"Researchers wishing to cite this collection should include the following information: [identification of item], [box], [folder], Earl Palmer Appalachian Photograph and Artifact Collection, Ms1989-025, Special Collections and University Archives, Virginia Tech, Blacksburg, Va.",,,,,,,,,,,,"Special Collections and University Archives, Virginia Tech",,,,,,,,,,,,,,,,,,,,,,,,,,,,,,,,,,,,,,,,,,,,,,,,,,,,,,,,,,,,,,,,,,,,,,,https://digitalsc.lib.vt.edu/files/original/030f5ab2518da40dd2d24ac640a34d9c.tiff,"Still Image","Earl Palmer Appalachian Photograph and Artifact Collection, 1880-1989 (Ms1989-025)",1,0
23368,https://digitalsc.lib.vt.edu/items/show/23368,"Pocohontas Exhibition Mine",,"Local/Regional History and Appalachian South^^Montgomery County (Va.)^^Photographs","Pocohontas Exhibition Mine",,,"Palmer, Earl, 1905-1996","<a href=""https://ead.lib.virginia.edu/vivaxtf/view?docId=oai/VT/repositories_2_resources_1652.xml&amp;chunk.id=&amp;toc.depth=1&amp;toc.id=&amp;brand=default"">See the finding aid for the Earl Palmer Appalachian Photograph and Artifact Collection</a>",,1940s-1970s,,,,,,,,,,"This Item is protected by copyright and/or related rights. You are free to use this Item in any way that is permitted by the copyright and related rights legislation that applies to your use. In addition, no permission is required from the rights-holder(s) for educational uses. For other uses, you need to obtain permission from the rights-holder(s). <a target=""_blank"" href=""https://rightsstatements.org/page/InC-EDU/1.0/?language=en"" rel=""noreferrer noopener"">https://rightsstatements.org/page/InC-EDU/1.0/</a>",,,,,,,,,Ms1989-025,,,,,,,,tiff,,,"No script-based materials.",Photographs,ep016,"Researchers wishing to cite this collection should include the following information: [identification of item], [box], [folder], Earl Palmer Appalachian Photograph and Artifact Collection, Ms1989-025, Special Collections and University Archives, Virginia Tech, Blacksburg, Va.",,,,,,,,,,,,"Special Collections and University Archives, Virginia Tech",,,,,,,,,,,,,,,,,,,,,,,,,,,,,,,,,,,,,,,,,,,,,,,,,,,,,,,,,,,,,,,,,,,,,,,https://digitalsc.lib.vt.edu/files/original/0dc880032f6fb6a06052029652ef3d8f.tiff,"Still Image","Earl Palmer Appalachian Photograph and Artifact Collection, 1880-1989 (Ms1989-025)",1,0
23369,https://digitalsc.lib.vt.edu/items/show/23369,"Pocohontas Exhibition Mine",,"Local/Regional History and Appalachian South^^Montgomery County (Va.)^^Photographs","Pocohontas Exhibition Mine",,,"Palmer, Earl, 1905-1996","<a href=""https://ead.lib.virginia.edu/vivaxtf/view?docId=oai/VT/repositories_2_resources_1652.xml&amp;chunk.id=&amp;toc.depth=1&amp;toc.id=&amp;brand=default"">See the finding aid for the Earl Palmer Appalachian Photograph and Artifact Collection</a>",,1940s-1970s,,,,,,,,,,"This Item is protected by copyright and/or related rights. You are free to use this Item in any way that is permitted by the copyright and related rights legislation that applies to your use. In addition, no permission is required from the rights-holder(s) for educational uses. For other uses, you need to obtain permission from the rights-holder(s). <a target=""_blank"" href=""https://rightsstatements.org/page/InC-EDU/1.0/?language=en"" rel=""noreferrer noopener"">https://rightsstatements.org/page/InC-EDU/1.0/</a>",,,,,,,,,Ms1989-025,,,,,,,,tiff,,,"No script-based materials.",Photographs,ep017,"Researchers wishing to cite this collection should include the following information: [identification of item], [box], [folder], Earl Palmer Appalachian Photograph and Artifact Collection, Ms1989-025, Special Collections and University Archives, Virginia Tech, Blacksburg, Va.",,,,,,,,,,,,"Special Collections and University Archives, Virginia Tech",,,,,,,,,,,,,,,,,,,,,,,,,,,,,,,,,,,,,,,,,,,,,,,,,,,,,,,,,,,,,,,,,,,,,,,https://digitalsc.lib.vt.edu/files/original/cca7ea6f56a6dd7a531ea92b49258b56.tiff,"Still Image","Earl Palmer Appalachian Photograph and Artifact Collection, 1880-1989 (Ms1989-025)",1,0