﻿"Item Id","Item URI","Dublin Core:Title","Dublin Core:Alternative Title","Dublin Core:Subject","Dublin Core:Description","Dublin Core:Abstract","Dublin Core:Table Of Contents","Dublin Core:Creator","Dublin Core:Source","Dublin Core:Publisher","Dublin Core:Date","Dublin Core:Date Available","Dublin Core:Date Created","Dublin Core:Date Accepted","Dublin Core:Date Copyrighted","Dublin Core:Date Submitted","Dublin Core:Date Issued","Dublin Core:Date Modified","Dublin Core:Date Valid","Dublin Core:Contributor","Dublin Core:Rights","Dublin Core:Access Rights","Dublin Core:License","Dublin Core:Relation","Dublin Core:Conforms To","Dublin Core:Has Format","Dublin Core:Has Part","Dublin Core:Has Version","Dublin Core:Is Format Of","Dublin Core:Is Part Of","Dublin Core:Is Referenced By","Dublin Core:Is Replaced By","Dublin Core:Is Required By","Dublin Core:Is Version Of","Dublin Core:References","Dublin Core:Replaces","Dublin Core:Requires","Dublin Core:Format","Dublin Core:Extent","Dublin Core:Medium","Dublin Core:Language","Dublin Core:Type","Dublin Core:Identifier","Dublin Core:Bibliographic Citation","Dublin Core:Coverage","Dublin Core:Spatial Coverage","Dublin Core:Temporal Coverage","Dublin Core:Accrual Method","Dublin Core:Accrual Periodicity","Dublin Core:Accrual Policy","Dublin Core:Audience","Dublin Core:Audience Education Level","Dublin Core:Mediator","Dublin Core:Instructional Method","Dublin Core:Provenance","Dublin Core:Rights Holder","Item Type Metadata:Text","Item Type Metadata:Interviewer","Item Type Metadata:Interviewee","Item Type Metadata:Location","Item Type Metadata:Transcription","Item Type Metadata:Local URL","Item Type Metadata:Original Format","Item Type Metadata:Physical Dimensions","Item Type Metadata:Duration","Item Type Metadata:Compression","Item Type Metadata:Producer","Item Type Metadata:Director","Item Type Metadata:Bit Rate/Frequency","Item Type Metadata:Time Summary","Item Type Metadata:Email Body","Item Type Metadata:Subject Line","Item Type Metadata:From","Item Type Metadata:To","Item Type Metadata:CC","Item Type Metadata:BCC","Item Type Metadata:Number of Attachments","Item Type Metadata:Standards","Item Type Metadata:Objectives","Item Type Metadata:Materials","Item Type Metadata:Lesson Plan Text","Item Type Metadata:URL","Item Type Metadata:Event Type","Item Type Metadata:Participants","Item Type Metadata:Birth Date","Item Type Metadata:Birthplace","Item Type Metadata:Death Date","Item Type Metadata:Occupation","Item Type Metadata:Biographical Text","Item Type Metadata:Bibliography","Item Type Metadata:Transcript","Item Type Metadata:Viewer","Item Type Metadata:Player","Item Type Metadata:Frame Rate","Item Type Metadata:Display Resolution","Item Type Metadata:Production Team","Item Type Metadata:Narrator","Omeka Legacy File:Additional Creator","Omeka Legacy File:Transcriber","Omeka Legacy File:Producer","Omeka Legacy File:Render Device","Omeka Legacy File:Render Details","Omeka Legacy File:Capture Date","Omeka Legacy File:Capture Device","Omeka Legacy File:Capture Details","Omeka Legacy File:Change History","Omeka Legacy File:Watermark","Omeka Legacy File:Encryption","Omeka Legacy File:Compression","Omeka Legacy File:Post Processing","Omeka Image File:Width","Omeka Image File:Height","Omeka Image File:Bit Depth","Omeka Image File:Channels","Omeka Image File:Exif String","Omeka Image File:Exif Array","Omeka Image File:IPTC String","Omeka Image File:IPTC Array","Omeka Video File:Bitrate","Omeka Video File:Duration","Omeka Video File:Sample Rate","Omeka Video File:Codec","Omeka Video File:Width","Omeka Video File:Height","PDF Text:Text",tags,file,itemType,collection,public,featured
23810,https://digitalsc.lib.vt.edu/items/show/23810,"Fossilized Frond",,"Local/Regional History and Appalachian South^^Montgomery County (Va.)^^Photographs","Fossilized Frond",,,"Palmer, Earl, 1905-1996","<a href=""https://ead.lib.virginia.edu/vivaxtf/view?docId=oai/VT/repositories_2_resources_1652.xml&amp;chunk.id=&amp;toc.depth=1&amp;toc.id=&amp;brand=default"">See the finding aid for the Earl Palmer Appalachian Photograph and Artifact Collection</a>",,1940s-1970s,,,,,,,,,,"This Item is protected by copyright and/or related rights. You are free to use this Item in any way that is permitted by the copyright and related rights legislation that applies to your use. In addition, no permission is required from the rights-holder(s) for educational uses. For other uses, you need to obtain permission from the rights-holder(s). <a target=""_blank"" href=""https://rightsstatements.org/page/InC-EDU/1.0/?language=en"" rel=""noreferrer noopener"">https://rightsstatements.org/page/InC-EDU/1.0/</a>",,,,,,,,,Ms1989-025,,,,,,,,tiff,,,"No script-based materials.",Photographs,ep458,"Researchers wishing to cite this collection should include the following information: [identification of item], [box], [folder], Earl Palmer Appalachian Photograph and Artifact Collection, Ms1989-025, Special Collections and University Archives, Virginia Tech, Blacksburg, Va.",,,,,,,,,,,,"Special Collections and University Archives, Virginia Tech",,,,,,,,,,,,,,,,,,,,,,,,,,,,,,,,,,,,,,,,,,,,,,,,,,,,,,,,,,,,,,,,,,,,,,,https://digitalsc.lib.vt.edu/files/original/2292c2df580c4ef79eea7a63c8a98b7f.tiff,"Still Image","Earl Palmer Appalachian Photograph and Artifact Collection, 1880-1989 (Ms1989-025)",1,0
23892,https://digitalsc.lib.vt.edu/items/show/23892,"Foot Trail at Peaks of Otter",,"Local/Regional History and Appalachian South^^Montgomery County (Va.)^^Photographs","Foot Trail at Peaks of Otter",,,"Palmer, Earl, 1905-1996","<a href=""https://ead.lib.virginia.edu/vivaxtf/view?docId=oai/VT/repositories_2_resources_1652.xml&amp;chunk.id=&amp;toc.depth=1&amp;toc.id=&amp;brand=default"">See the finding aid for the Earl Palmer Appalachian Photograph and Artifact Collection</a>",,1940s-1970s,,,,,,,,,,"This Item is protected by copyright and/or related rights. You are free to use this Item in any way that is permitted by the copyright and related rights legislation that applies to your use. In addition, no permission is required from the rights-holder(s) for educational uses. For other uses, you need to obtain permission from the rights-holder(s). <a target=""_blank"" href=""https://rightsstatements.org/page/InC-EDU/1.0/?language=en"" rel=""noreferrer noopener"">https://rightsstatements.org/page/InC-EDU/1.0/</a>",,,,,,,,,Ms1989-025,,,,,,,,tiff,,,"No script-based materials.",Photographs,ep541,"Researchers wishing to cite this collection should include the following information: [identification of item], [box], [folder], Earl Palmer Appalachian Photograph and Artifact Collection, Ms1989-025, Special Collections and University Archives, Virginia Tech, Blacksburg, Va.",,,,,,,,,,,,"Special Collections and University Archives, Virginia Tech",,,,,,,,,,,,,,,,,,,,,,,,,,,,,,,,,,,,,,,,,,,,,,,,,,,,,,,,,,,,,,,,,,,,,,,https://digitalsc.lib.vt.edu/files/original/d8b48e7c24ac552657ad9c3b18a9f633.tiff,"Still Image","Earl Palmer Appalachian Photograph and Artifact Collection, 1880-1989 (Ms1989-025)",1,0
12662,https://digitalsc.lib.vt.edu/items/show/12662,"Foot stool and photograph of foot stool being created",,"Solitude (Blacksburg, Va.: Historic building)^^Blacksburg (Va.)^^Montgomery County (Va.)^^Local/Regional History and Appalachian South^^Virginia Polytechnic Institute and State University^^University History","Color image.",,,,"<a target=""_blank"" href=""https://ead.lib.virginia.edu/vivaxtf/view?docId=oai/VT/repositories_2_resources_1652.xml&chunk.id=&toc.depth=1&toc.id=&brand=default"">See the finding aid for the Earl Palmer Appalachian Photograph and Artifact Collection.</a>",,,,,,,,,,,,"This Item is protected by copyright and/or related rights. You are free to use this Item in any way that is permitted by the copyright and related rights legislation that applies to your use. In addition, no permission is required from the rights-holder(s) for non-commercial uses. For other uses you need to obtain permission from the rights-holder(s). <a href=""https://rightsstatements.org/page/InC-NC/1.0/?language=en"" target=""_blank"" rel=""noreferrer noopener"">https://rightsstatements.org/page/InC-NC/1.0/?language=en</a>",,,,,,,,,"Earl Palmer Appalachian Photograph and Artifact Collection, 1880-1989 (Ms1989-025)",,,,,,,,image/jpg,,,"No language or script-based material",Photographs,"SOLITUDE0043; SOLUTIDE0076","[item description], Earl Palmer Appalachian Photograph and Artifact Collection, 1880-1989 (Ms1989-025), Special Collections and University Archives, Virginia Tech. ",,,,,,,,,,,,"Special Collections and University Archives, Virginia Tech",,,,,,,,,,,,,,,,,,,,,,,,,,,,,,,,,,,,,,,,,,,,,,,,,,,,,,,,,,,,,,,,,,,,,,,"https://digitalsc.lib.vt.edu/files/original/8f10bf8c5945c896809d66b080fb88bd.jpg,https://digitalsc.lib.vt.edu/files/original/c88fa6ed4967e052fc922412c44a919d.jpg","Still Image","Earl Palmer Appalachian Photograph and Artifact Collection, 1880-1989 (Ms1989-025)",1,0
23839,https://digitalsc.lib.vt.edu/items/show/23839,"Folk Drama at Swappin' Meetin'",,"Local/Regional History and Appalachian South^^Montgomery County (Va.)^^Photographs","Folk Drama at Swappin' Meetin'",,,"Palmer, Earl, 1905-1996","<a href=""https://ead.lib.virginia.edu/vivaxtf/view?docId=oai/VT/repositories_2_resources_1652.xml&amp;chunk.id=&amp;toc.depth=1&amp;toc.id=&amp;brand=default"">See the finding aid for the Earl Palmer Appalachian Photograph and Artifact Collection</a>",,1940s-1970s,,,,,,,,,,"This Item is protected by copyright and/or related rights. You are free to use this Item in any way that is permitted by the copyright and related rights legislation that applies to your use. In addition, no permission is required from the rights-holder(s) for educational uses. For other uses, you need to obtain permission from the rights-holder(s). <a target=""_blank"" href=""https://rightsstatements.org/page/InC-EDU/1.0/?language=en"" rel=""noreferrer noopener"">https://rightsstatements.org/page/InC-EDU/1.0/</a>",,,,,,,,,Ms1989-025,,,,,,,,tiff,,,"No script-based materials.",Photographs,ep487,"Researchers wishing to cite this collection should include the following information: [identification of item], [box], [folder], Earl Palmer Appalachian Photograph and Artifact Collection, Ms1989-025, Special Collections and University Archives, Virginia Tech, Blacksburg, Va.",,,,,,,,,,,,"Special Collections and University Archives, Virginia Tech",,,,,,,,,,,,,,,,,,,,,,,,,,,,,,,,,,,,,,,,,,,,,,,,,,,,,,,,,,,,,,,,,,,,,,,https://digitalsc.lib.vt.edu/files/original/f0a5b4b16de4283418586c3223e0c6c3.tiff,"Still Image","Earl Palmer Appalachian Photograph and Artifact Collection, 1880-1989 (Ms1989-025)",1,0
23518,https://digitalsc.lib.vt.edu/items/show/23518,"Folk Dancing",,"Local/Regional History and Appalachian South^^Montgomery County (Va.)^^Photographs","Folk Dancing",,,"Palmer, Earl, 1905-1996","<a href=""https://ead.lib.virginia.edu/vivaxtf/view?docId=oai/VT/repositories_2_resources_1652.xml&amp;chunk.id=&amp;toc.depth=1&amp;toc.id=&amp;brand=default"">See the finding aid for the Earl Palmer Appalachian Photograph and Artifact Collection</a>",,1940s-1970s,,,,,,,,,,"This Item is protected by copyright and/or related rights. You are free to use this Item in any way that is permitted by the copyright and related rights legislation that applies to your use. In addition, no permission is required from the rights-holder(s) for educational uses. For other uses, you need to obtain permission from the rights-holder(s). <a target=""_blank"" href=""https://rightsstatements.org/page/InC-EDU/1.0/?language=en"" rel=""noreferrer noopener"">https://rightsstatements.org/page/InC-EDU/1.0/</a>",,,,,,,,,Ms1989-025,,,,,,,,tiff,,,"No script-based materials.",Photographs,ep166,"Researchers wishing to cite this collection should include the following information: [identification of item], [box], [folder], Earl Palmer Appalachian Photograph and Artifact Collection, Ms1989-025, Special Collections and University Archives, Virginia Tech, Blacksburg, Va.",,,,,,,,,,,,"Special Collections and University Archives, Virginia Tech",,,,,,,,,,,,,,,,,,,,,,,,,,,,,,,,,,,,,,,,,,,,,,,,,,,,,,,,,,,,,,,,,,,,,,,https://digitalsc.lib.vt.edu/files/original/2be621d26cc071346ad591b2215662ef.tiff,"Still Image","Earl Palmer Appalachian Photograph and Artifact Collection, 1880-1989 (Ms1989-025)",1,0
23497,https://digitalsc.lib.vt.edu/items/show/23497,"Floyd Co., Virginia, Interior of Evie Shelton's Store",,"Local/Regional History and Appalachian South^^Montgomery County (Va.)^^Photographs","Floyd Co., Virginia, Interior of Evie Shelton's Store",,,"Palmer, Earl, 1905-1996","<a href=""https://ead.lib.virginia.edu/vivaxtf/view?docId=oai/VT/repositories_2_resources_1652.xml&amp;chunk.id=&amp;toc.depth=1&amp;toc.id=&amp;brand=default"">See the finding aid for the Earl Palmer Appalachian Photograph and Artifact Collection</a>",,1940s-1970s,,,,,,,,,,"This Item is protected by copyright and/or related rights. You are free to use this Item in any way that is permitted by the copyright and related rights legislation that applies to your use. In addition, no permission is required from the rights-holder(s) for educational uses. For other uses, you need to obtain permission from the rights-holder(s). <a target=""_blank"" href=""https://rightsstatements.org/page/InC-EDU/1.0/?language=en"" rel=""noreferrer noopener"">https://rightsstatements.org/page/InC-EDU/1.0/</a>",,,,,,,,,Ms1989-025,,,,,,,,tiff,,,"No script-based materials.",Photographs,ep145,"Researchers wishing to cite this collection should include the following information: [identification of item], [box], [folder], Earl Palmer Appalachian Photograph and Artifact Collection, Ms1989-025, Special Collections and University Archives, Virginia Tech, Blacksburg, Va.",,,,,,,,,,,,"Special Collections and University Archives, Virginia Tech",,,,,,,,,,,,,,,,,,,,,,,,,,,,,,,,,,,,,,,,,,,,,,,,,,,,,,,,,,,,,,,,,,,,,,,https://digitalsc.lib.vt.edu/files/original/c82a63ca7eedecff4fb749284ea918b1.tiff,"Still Image","Earl Palmer Appalachian Photograph and Artifact Collection, 1880-1989 (Ms1989-025)",1,0
23825,https://digitalsc.lib.vt.edu/items/show/23825,"Flowering Dogwood",,"Local/Regional History and Appalachian South^^Montgomery County (Va.)^^Photographs","Flowering Dogwood",,,"Palmer, Earl, 1905-1996","<a href=""https://ead.lib.virginia.edu/vivaxtf/view?docId=oai/VT/repositories_2_resources_1652.xml&amp;chunk.id=&amp;toc.depth=1&amp;toc.id=&amp;brand=default"">See the finding aid for the Earl Palmer Appalachian Photograph and Artifact Collection</a>",,1940s-1970s,,,,,,,,,,"This Item is protected by copyright and/or related rights. You are free to use this Item in any way that is permitted by the copyright and related rights legislation that applies to your use. In addition, no permission is required from the rights-holder(s) for educational uses. For other uses, you need to obtain permission from the rights-holder(s). <a target=""_blank"" href=""https://rightsstatements.org/page/InC-EDU/1.0/?language=en"" rel=""noreferrer noopener"">https://rightsstatements.org/page/InC-EDU/1.0/</a>",,,,,,,,,Ms1989-025,,,,,,,,tiff,,,"No script-based materials.",Photographs,ep473,"Researchers wishing to cite this collection should include the following information: [identification of item], [box], [folder], Earl Palmer Appalachian Photograph and Artifact Collection, Ms1989-025, Special Collections and University Archives, Virginia Tech, Blacksburg, Va.",,,,,,,,,,,,"Special Collections and University Archives, Virginia Tech",,,,,,,,,,,,,,,,,,,,,,,,,,,,,,,,,,,,,,,,,,,,,,,,,,,,,,,,,,,,,,,,,,,,,,,https://digitalsc.lib.vt.edu/files/original/88c8fc0d3f9cf61356dff89f2cd9e05e.tiff,"Still Image","Earl Palmer Appalachian Photograph and Artifact Collection, 1880-1989 (Ms1989-025)",1,0
23529,https://digitalsc.lib.vt.edu/items/show/23529,"Fishing on the River",,"Local/Regional History and Appalachian South^^Montgomery County (Va.)^^Photographs","Fishing on the River",,,"Palmer, Earl, 1905-1996","<a href=""https://ead.lib.virginia.edu/vivaxtf/view?docId=oai/VT/repositories_2_resources_1652.xml&amp;chunk.id=&amp;toc.depth=1&amp;toc.id=&amp;brand=default"">See the finding aid for the Earl Palmer Appalachian Photograph and Artifact Collection</a>",,1940s-1970s,,,,,,,,,,"This Item is protected by copyright and/or related rights. You are free to use this Item in any way that is permitted by the copyright and related rights legislation that applies to your use. In addition, no permission is required from the rights-holder(s) for educational uses. For other uses, you need to obtain permission from the rights-holder(s). <a target=""_blank"" href=""https://rightsstatements.org/page/InC-EDU/1.0/?language=en"" rel=""noreferrer noopener"">https://rightsstatements.org/page/InC-EDU/1.0/</a>",,,,,,,,,Ms1989-025,,,,,,,,tiff,,,"No script-based materials.",Photographs,ep177,"Researchers wishing to cite this collection should include the following information: [identification of item], [box], [folder], Earl Palmer Appalachian Photograph and Artifact Collection, Ms1989-025, Special Collections and University Archives, Virginia Tech, Blacksburg, Va.",,,,,,,,,,,,"Special Collections and University Archives, Virginia Tech",,,,,,,,,,,,,,,,,,,,,,,,,,,,,,,,,,,,,,,,,,,,,,,,,,,,,,,,,,,,,,,,,,,,,,,https://digitalsc.lib.vt.edu/files/original/8af5720743c490b9e2451eb063910130.tiff,"Still Image","Earl Palmer Appalachian Photograph and Artifact Collection, 1880-1989 (Ms1989-025)",1,0
23530,https://digitalsc.lib.vt.edu/items/show/23530,"Fishing by the Falls",,"Local/Regional History and Appalachian South^^Montgomery County (Va.)^^Photographs","Fishing by the Falls",,,"Palmer, Earl, 1905-1996","<a href=""https://ead.lib.virginia.edu/vivaxtf/view?docId=oai/VT/repositories_2_resources_1652.xml&amp;chunk.id=&amp;toc.depth=1&amp;toc.id=&amp;brand=default"">See the finding aid for the Earl Palmer Appalachian Photograph and Artifact Collection</a>",,1940s-1970s,,,,,,,,,,"This Item is protected by copyright and/or related rights. You are free to use this Item in any way that is permitted by the copyright and related rights legislation that applies to your use. In addition, no permission is required from the rights-holder(s) for educational uses. For other uses, you need to obtain permission from the rights-holder(s). <a target=""_blank"" href=""https://rightsstatements.org/page/InC-EDU/1.0/?language=en"" rel=""noreferrer noopener"">https://rightsstatements.org/page/InC-EDU/1.0/</a>",,,,,,,,,Ms1989-025,,,,,,,,tiff,,,"No script-based materials.",Photographs,ep178,"Researchers wishing to cite this collection should include the following information: [identification of item], [box], [folder], Earl Palmer Appalachian Photograph and Artifact Collection, Ms1989-025, Special Collections and University Archives, Virginia Tech, Blacksburg, Va.",,,,,,,,,,,,"Special Collections and University Archives, Virginia Tech",,,,,,,,,,,,,,,,,,,,,,,,,,,,,,,,,,,,,,,,,,,,,,,,,,,,,,,,,,,,,,,,,,,,,,,https://digitalsc.lib.vt.edu/files/original/e5700cc1a52ee314afc71b99582089bc.tiff,"Still Image","Earl Palmer Appalachian Photograph and Artifact Collection, 1880-1989 (Ms1989-025)",1,0
23513,https://digitalsc.lib.vt.edu/items/show/23513,"Fishing at the Falls",,"Local/Regional History and Appalachian South^^Montgomery County (Va.)^^Photographs","Fishing at the Falls",,,"Palmer, Earl, 1905-1996","<a href=""https://ead.lib.virginia.edu/vivaxtf/view?docId=oai/VT/repositories_2_resources_1652.xml&amp;chunk.id=&amp;toc.depth=1&amp;toc.id=&amp;brand=default"">See the finding aid for the Earl Palmer Appalachian Photograph and Artifact Collection</a>",,1940s-1970s,,,,,,,,,,"This Item is protected by copyright and/or related rights. You are free to use this Item in any way that is permitted by the copyright and related rights legislation that applies to your use. In addition, no permission is required from the rights-holder(s) for educational uses. For other uses, you need to obtain permission from the rights-holder(s). <a target=""_blank"" href=""https://rightsstatements.org/page/InC-EDU/1.0/?language=en"" rel=""noreferrer noopener"">https://rightsstatements.org/page/InC-EDU/1.0/</a>",,,,,,,,,Ms1989-025,,,,,,,,tiff,,,"No script-based materials.",Photographs,ep161,"Researchers wishing to cite this collection should include the following information: [identification of item], [box], [folder], Earl Palmer Appalachian Photograph and Artifact Collection, Ms1989-025, Special Collections and University Archives, Virginia Tech, Blacksburg, Va.",,,,,,,,,,,,"Special Collections and University Archives, Virginia Tech",,,,,,,,,,,,,,,,,,,,,,,,,,,,,,,,,,,,,,,,,,,,,,,,,,,,,,,,,,,,,,,,,,,,,,,https://digitalsc.lib.vt.edu/files/original/ee3a04a9d592cdcc839d0819bb140c11.tiff,"Still Image","Earl Palmer Appalachian Photograph and Artifact Collection, 1880-1989 (Ms1989-025)",1,0
23535,https://digitalsc.lib.vt.edu/items/show/23535,"Fishing at the Campsite",,"Local/Regional History and Appalachian South^^Montgomery County (Va.)^^Photographs","Fishing at the Campsite",,,"Palmer, Earl, 1905-1996","<a href=""https://ead.lib.virginia.edu/vivaxtf/view?docId=oai/VT/repositories_2_resources_1652.xml&amp;chunk.id=&amp;toc.depth=1&amp;toc.id=&amp;brand=default"">See the finding aid for the Earl Palmer Appalachian Photograph and Artifact Collection</a>",,1940s-1970s,,,,,,,,,,"This Item is protected by copyright and/or related rights. You are free to use this Item in any way that is permitted by the copyright and related rights legislation that applies to your use. In addition, no permission is required from the rights-holder(s) for educational uses. For other uses, you need to obtain permission from the rights-holder(s). <a target=""_blank"" href=""https://rightsstatements.org/page/InC-EDU/1.0/?language=en"" rel=""noreferrer noopener"">https://rightsstatements.org/page/InC-EDU/1.0/</a>",,,,,,,,,Ms1989-025,,,,,,,,tiff,,,"No script-based materials.",Photographs,ep183,"Researchers wishing to cite this collection should include the following information: [identification of item], [box], [folder], Earl Palmer Appalachian Photograph and Artifact Collection, Ms1989-025, Special Collections and University Archives, Virginia Tech, Blacksburg, Va.",,,,,,,,,,,,"Special Collections and University Archives, Virginia Tech",,,,,,,,,,,,,,,,,,,,,,,,,,,,,,,,,,,,,,,,,,,,,,,,,,,,,,,,,,,,,,,,,,,,,,,https://digitalsc.lib.vt.edu/files/original/1c087c9b65a6e7114ba3ab171ae94bc9.tiff,"Still Image","Earl Palmer Appalachian Photograph and Artifact Collection, 1880-1989 (Ms1989-025)",1,0