﻿"Dublin Core:Title","Dublin Core:Alternative Title","Dublin Core:Subject","Dublin Core:Description","Dublin Core:Abstract","Dublin Core:Table Of Contents","Dublin Core:Creator","Dublin Core:Source","Dublin Core:Publisher","Dublin Core:Date","Dublin Core:Date Available","Dublin Core:Date Created","Dublin Core:Date Accepted","Dublin Core:Date Copyrighted","Dublin Core:Date Submitted","Dublin Core:Date Issued","Dublin Core:Date Modified","Dublin Core:Date Valid","Dublin Core:Contributor","Dublin Core:Rights","Dublin Core:Access Rights","Dublin Core:License","Dublin Core:Relation","Dublin Core:Conforms To","Dublin Core:Has Format","Dublin Core:Has Part","Dublin Core:Has Version","Dublin Core:Is Format Of","Dublin Core:Is Part Of","Dublin Core:Is Referenced By","Dublin Core:Is Replaced By","Dublin Core:Is Required By","Dublin Core:Is Version Of","Dublin Core:References","Dublin Core:Replaces","Dublin Core:Requires","Dublin Core:Format","Dublin Core:Extent","Dublin Core:Medium","Dublin Core:Language","Dublin Core:Type","Dublin Core:Identifier","Dublin Core:Bibliographic Citation","Dublin Core:Coverage","Dublin Core:Spatial Coverage","Dublin Core:Temporal Coverage","Dublin Core:Accrual Method","Dublin Core:Accrual Periodicity","Dublin Core:Accrual Policy","Dublin Core:Audience","Dublin Core:Audience Education Level","Dublin Core:Mediator","Dublin Core:Instructional Method","Dublin Core:Provenance","Dublin Core:Rights Holder","Item Type Metadata:Text","Item Type Metadata:Interviewer","Item Type Metadata:Interviewee","Item Type Metadata:Location","Item Type Metadata:Transcription","Item Type Metadata:Local URL","Item Type Metadata:Original Format","Item Type Metadata:Physical Dimensions","Item Type Metadata:Duration","Item Type Metadata:Compression","Item Type Metadata:Producer","Item Type Metadata:Director","Item Type Metadata:Bit Rate/Frequency","Item Type Metadata:Time Summary","Item Type Metadata:Email Body","Item Type Metadata:Subject Line","Item Type Metadata:From","Item Type Metadata:To","Item Type Metadata:CC","Item Type Metadata:BCC","Item Type Metadata:Number of Attachments","Item Type Metadata:Standards","Item Type Metadata:Objectives","Item Type Metadata:Materials","Item Type Metadata:Lesson Plan Text","Item Type Metadata:URL","Item Type Metadata:Event Type","Item Type Metadata:Participants","Item Type Metadata:Birth Date","Item Type Metadata:Birthplace","Item Type Metadata:Death Date","Item Type Metadata:Occupation","Item Type Metadata:Biographical Text","Item Type Metadata:Bibliography","Item Type Metadata:Transcript","Item Type Metadata:Viewer","Item Type Metadata:Narrator","Item Type Metadata:Production Team","Item Type Metadata:Display Resolution","Item Type Metadata:Frame Rate","Item Type Metadata:Player","Omeka Legacy File:Additional Creator","Omeka Legacy File:Transcriber","Omeka Legacy File:Producer","Omeka Legacy File:Render Device","Omeka Legacy File:Render Details","Omeka Legacy File:Capture Date","Omeka Legacy File:Capture Device","Omeka Legacy File:Capture Details","Omeka Legacy File:Change History","Omeka Legacy File:Watermark","Omeka Legacy File:Encryption","Omeka Legacy File:Compression","Omeka Legacy File:Post Processing","Omeka Image File:Width","Omeka Image File:Height","Omeka Image File:Bit Depth","Omeka Image File:Channels","Omeka Image File:Exif String","Omeka Image File:Exif Array","Omeka Image File:IPTC String","Omeka Image File:IPTC Array","Omeka Video File:Bitrate","Omeka Video File:Duration","Omeka Video File:Sample Rate","Omeka Video File:Codec","Omeka Video File:Width","Omeka Video File:Height","PDF Text:Text",Scripto:Transcription,tags,file,itemType,collection,public,featured
"Doc Tyler, Men's Football Trainer, the 1921 Bugle",,"University History",,,,,,,1921,,,,,,,,,,"Permission to publish material from the Virginia Tech Black History Collection must be obtained from Special Collections, Virginia Tech.",,,,,,,,,,,,,,,,,,,,,Clippings,DocTyler_1921,,,,,,,,,,,,,,,,,,,,,,,,,,,,,,,,,,,,,,,,,,,,,,,,,,,,,,,,,,,,,,,,,,,,,,,,,,,,,,,,,,,,,http://digitalsc.lib.vt.edu/files/original/4be9c7bcb6a7c21c8afa816cd07f7534.jpg,Document,"Black History at Virginia Tech - Athletics",1,0
"Dwight Vick, Former Lineman Tackles Youth Issues, The Collegiate Times, September 12, 2013",,"University History",,,,,,,2013-09-12,,,,,,,,,,"Permission to publish material from the Virginia Tech Black History Collection must be obtained from Special Collections, Virginia Tech.",,,,,,,,,,,,,,,,,,,,,Clippings,2013_Sept12_pg1and2,,,,,,,,,,,,,,,,,,,,,,,,,,,,,,,,,,,,,,,,,,,,,,,,,PDF,,,,,,,,,,,,,,,,,,,,,,,,,,,,,,,,,,,,http://spec.lib.vt.edu/pickup/Omeka_upload/2013_Sept12_pg1and2.pdf,Document,"Black History at Virginia Tech - Athletics",1,0
"Eddie Lucas, 1999",,"University History",,,,,,,1999,,,,,,,,,,"Permission to publish material from the Virginia Tech Black History Collection must be obtained from Special Collections, Virginia Tech.",,,,,,,,,,,,,,,,,,,,,Clippings,LucasEddie_1999Bugle_pg68,,,,,,,,,,,,,,,,,,,,,,,,,,,,,,,,,,,,,,,,,,,,,,,,,,,,,,,,,,,,,,,,,,,,,,,,,,,,,,,,,,,,,http://spec.lib.vt.edu/pickup/Omeka_upload/LucasEddie_1999Bugle_pg68.jpg,Document,"Black History at Virginia Tech - Athletics",1,0
"Eric McClellan, 1991",,"University History",,,,,,,1991,,,,,,,,,,"Permission to publish material from the Virginia Tech Black History Collection must be obtained from Special Collections, Virginia Tech.",,,,,,,,,,,,,,,,,,,,,Photographs,McClellanEric_1991_pg183,,,,,,,,,,,,,,,,,,,,,,,,,,,,,,,,,,,,,,,,,,,,,,,,,,,,,,,,,,,,,,,,,,,,,,,,,,,,,,,,,,,,,http://spec.lib.vt.edu/pickup/Omeka_upload/McClellanEric_1991_pg183.jpg,Document,"Black History at Virginia Tech - Athletics",1,0
"Former Tech Athletes Making News at Pro Level, Collegiate Times, July 22, 2010",,"University History",,,,,,,2010-07-22,,,,,,,,,,"Permission to publish material from the Virginia Tech Black History Collection must be obtained from Special Collections, Virginia Tech.",,,,,,,,,,,,,,,,,,,,,Clippings,2010_July22_pg12,,,,,,,,,,,,,,,,,,,,,,,,,,,,,,,,,,,,,,,,,,,,,,,,,,,,,,,,,,,,,,,,,,,,,,,,,,,,,,,,,,,,,http://spec.lib.vt.edu/pickup/Omeka_upload/2010_July22_pg12.jpg,Document,"Black History at Virginia Tech - Athletics",1,0
"Frankie Allen, 1990",,"University History",,,,,,,1990,,,,,,,,,,"Permission to publish material from the Virginia Tech Black History Collection must be obtained from Special Collections, Virginia Tech.",,,,,,,,,,,,,,,,,,,,,Clippings,AllenFrankie_1990,,,,,,,,,,,,,,,,,,,,,,,,,,,,,,,,,,,,,,,,,,,,,,,,,,,,,,,,,,,,,,,,,,,,,,,,,,,,,,,,,,,,,http://spec.lib.vt.edu/pickup/Omeka_upload/AllenFrankie_1990.jpg,Document,"Black History at Virginia Tech - Athletics",1,0
"Frankie Allen, Being a First Was Secondary to Being a Star, Roanoke Times, April 27, 1997",,"University History",,,,,,,1997-04-27,,,,,,,,,,"Permission to publish material from the Virginia Tech Black History Collection must be obtained from Special Collections, Virginia Tech.",,,,,,,,,,,,,,,,,,,,,Clippings,AllenFrankie_RT_1997_0427,,,,,,,,,,,,,,,,,,,,,,,,,,,,,,,,,,,,,,,,,,,,,,,,,PDF,,,,,,,,,,,,,,,,,,,,,,,,,,,,,,,,,,,,http://spec.lib.vt.edu/pickup/Omeka_upload/AllenFrankie_RT_1997_0427.pdf,Document,"Black History at Virginia Tech - Athletics",1,0
"Frankie Allen, Metro Coach of the Year, Montgomery News Messenger, March 11, 1988",,"University History",,,,,,,1988-03-11,,,,,,,,,,"Permission to publish material from the Virginia Tech Black History Collection must be obtained from Special Collections, Virginia Tech.",,,,,,,,,,,,,,,,,,,,,Clippings,AllenFrankie_MNM_1988_0311,,,,,,,,,,,,,,,,,,,,,,,,,,,,,,,,,,,,,,,,,,,,,,,,,PDF,,,,,,,,,,,,,,,,,,,,,,,,,,,,,,,,,,,,http://spec.lib.vt.edu/pickup/Omeka_upload/AllenFrankie_MNM_1988_0311.pdf,Document,"Black History at Virginia Tech - Athletics",1,0
"Franklin Stubbs, 1982",,"University History",,,,,,,1982,,,,,,,,,,"Permission to publish material from the Virginia Tech Black History Collection must be obtained from Special Collections, Virginia Tech.",,,,,,,,,,,,,,,,,,,,,Photographs,StubbsFranklin_1982,,,,,,,,,,,,,,,,,,,,,,,,,,,,,,,,,,,,,,,,,,,,,,,,,,,,,,,,,,,,,,,,,,,,,,,,,,,,,,,,,,,,,http://spec.lib.vt.edu/pickup/Omeka_upload/StubbsFranklin_1982.jpg,Document,"Black History at Virginia Tech - Athletics",1,0
"Harrison Sets New School Record, Strives for NCAA Title, Collegiate Times, February 3, 2010",,"University History",,,,,,,2010-02-03,,,,,,,,,,"Permission to publish material from the Virginia Tech Black History Collection must be obtained from Special Collections, Virginia Tech.",,,,,,,,,,,,,,,,,,,,,Clippings,2010_Feb3_pg7,,,,,,,,,,,,,,,,,,,,,,,,,,,,,,,,,,,,,,,,,,,,,,,,,,,,,,,,,,,,,,,,,,,,,,,,,,,,,,,,,,,,,http://spec.lib.vt.edu/pickup/Omeka_upload/2010_Feb3_pg7.jpg,Document,"Black History at Virginia Tech - Athletics",1,0
"Hidden in Plain Sight, New Men's Basketball Coach James Johnson, The Collegiate Times, May 2, 2012",,"University History",,,,,,,2012-05-02,,,,,,,,,,"Permission to publish material from the Virginia Tech Black History Collection must be obtained from Special Collections, Virginia Tech.",,,,,,,,,,,,,,,,,,,,,Clippings,2012_May2_pg1and4,,,,,,,,,,,,,,,,,,,,,,,,,,,,,,,,,,,,,,,,,,,,,,,,,PDF,,,,,,,,,,,,,,,,,,,,,,,,,,,,,,,,,,,,http://spec.lib.vt.edu/pickup/Omeka_upload/2012_May2_pg1and4.pdf,Document,"Black History at Virginia Tech - Athletics",1,0
"Jerry Gaines",,"University History",,,,,,,,,,,,,,,,,"Permission to publish material from the Virginia Tech Black History Collection must be obtained from Special Collections, Virginia Tech.",,,,,,,,,,,,,,,,,,,,,Clippings,GainesJerry_1990,,,,,,,,,,,,,,,,,,,,,,,,,,,,,,,,,,,,,,,,,,,,,,,,,,,,,,,,,,,,,,,,,,,,,,,,,,,,,,,,,,,,,http://spec.lib.vt.edu/pickup/Omeka_upload/GainesJerry_1990.jpg,Document,"Black History at Virginia Tech - Athletics",1,0
"Jerry Gaines, Athlete of the Week, The Collegiate Times, April 17, 1986",,"University History",,,,,,,1986-04-17,,,,,,,,,,"Permission to publish material from the Virginia Tech Black History Collection must be obtained from Special Collections, Virginia Tech.",,,,,,,,,,,,,,,,,,,,,Clippings,CT_1986_0417_pg6,,,,,,,,,,,,,,,,,,,,,,,,,,,,,,,,,,,,,,,,,,,,,,,,,,,,,,,,,,,,,,,,,,,,,,,,,,,,,,,,,,,,,http://digitalsc.lib.vt.edu/files/original/65a425e572b331447d95b409d1688e26.jpg,Document,"Black History at Virginia Tech - Athletics",1,0
"Jerry Gaines, Men's Track and Field, 1971",,"University History",,,,,,,1971,,,,,,,,,,"Permission to publish material from the Virginia Tech Black History Collection must be obtained from Special Collections, Virginia Tech.",,,,,,,,,,,,,,,,,,,,,Photographs,Gaines_Jerry_1971,,,,,,,,,,,,,,,,,,,,,,,,,,,,,,,,,,,,,,,,,,,,,,,,,,,,,,,,,,,,,,,,,,,,,,,,,,,,,,,,,,,,,http://spec.lib.vt.edu/pickup/Omeka_upload/Gaines_Jerry_1971.jpg,Document,"Black History at Virginia Tech - Athletics",1,0
"Jerry Gaines, Men's Track and Field, the 1969 Bugle, pg 122",,"University History",,,,,,,1969,,,,,,,,,,"Permission to publish material from the Virginia Tech Black History Collection must be obtained from Special Collections, Virginia Tech.",,,,,,,,,,,,,,,,,,,,,Clippings,Bugle1969_pg122_Gaines,,,,,,,,,,,,,,,,,,,,,,,,,,,,,,,,,,,,,,,,,,,,,,,,,,,,,,,,,,,,,,,,,,,,,,,,,,,,,,,,,,,,,http://spec.lib.vt.edu/pickup/Omeka_upload/Bugle1969_pg122_Gaines.jpg,Document,"Black History at Virginia Tech - Athletics",1,0
"Jerry Gaines, Men's Track and Field, the 1969 Bugle, pg 123",,"University History",,,,,,,1969,,,,,,,,,,"Permission to publish material from the Virginia Tech Black History Collection must be obtained from Special Collections, Virginia Tech.",,,,,,,,,,,,,,,,,,,,,Photographs,Bugle1969_pg123_Gaines,,,,,,,,,,,,,,,,,,,,,,,,,,,,,,,,,,,,,,,,,,,,,,,,,,,,,,,,,,,,,,,,,,,,,,,,,,,,,,,,,,,,,http://spec.lib.vt.edu/pickup/Omeka_upload/Bugle1969_pg123_Gaines.jpg,Document,"Black History at Virginia Tech - Athletics",1,0
"Joe Watts, Men's Rugby, the 1981 Bugle, pg 184",,"University History",,,,,,,1981,,,,,,,,,,"Permission to publish material from the Virginia Tech Black History Collection must be obtained from Special Collections, Virginia Tech.",,,,,,,,,,,,,,,,,,,,,Clippings,Bugle1981_pg184_Rugby,,,,,,,,,,,,,,,,,,,,,,,,,,,,,,,,,,,,,,,,,,,,,,,,,,,,,,,,,,,,,,,,,,,,,,,,,,,,,,,,,,,,,http://spec.lib.vt.edu/pickup/Omeka_upload/Bugle1981_pg184_Rugby.jpg,Document,"Black History at Virginia Tech - Athletics",1,0
"John Dobbins, Football Star Was Also a Behind-the-Scenes Hero, The Roanoke Times, March 9, 2003",,"University History",,,,,,,2003-03-09,,,,,,,,,,"Permission to publish material from the Virginia Tech Black History Collection must be obtained from Special Collections, Virginia Tech.",,,,,,,,,,,,,,,,,,,,,Clippings,Dobbins_John_2003NewspaperArticle,,,,,,,,,,,,,,,,,,,,,,,,,,,,,,,,,,,,,,,,,,,,,,,,,,,,,,,,,,,,,,,,,,,,,,,,,,,,,,,,,,,,,http://spec.lib.vt.edu/pickup/Omeka_upload/Dobbins_John_2003NewspaperArticle.jpg,Document,"Black History at Virginia Tech - Athletics",1,0
"Kenny Lewis",,"University History",,,,,,,,,,,,,,,,,"Permission to publish material from the Virginia Tech Black History Collection must be obtained from Special Collections, Virginia Tech.",,,,,,,,,,,,,,,,,,,,,Clippings,LewisKenny_1998,,,,,,,,,,,,,,,,,,,,,,,,,,,,,,,,,,,,,,,,,,,,,,,,,,,,,,,,,,,,,,,,,,,,,,,,,,,,,,,,,,,,,http://spec.lib.vt.edu/pickup/Omeka_upload/LewisKenny_1998.jpg,Document,"Black History at Virginia Tech - Athletics",1,0
"Kenny Lewis, 1979",,"University History",,,,,,,1979,,,,,,,,,,"Permission to publish material from the Virginia Tech Black History Collection must be obtained from Special Collections, Virginia Tech.",,,,,,,,,,,,,,,,,,,,,Clippings,LewisKenny_1979,,,,,,,,,,,,,,,,,,,,,,,,,,,,,,,,,,,,,,,,,,,,,,,,,,,,,,,,,,,,,,,,,,,,,,,,,,,,,,,,,,,,,http://spec.lib.vt.edu/pickup/Omeka_upload/LewisKenny_1979.jpg,Document,"Black History at Virginia Tech - Athletics",1,0
"Kevin Jones and Lee Suggs, Men's Football, the 2003 Bugle, pg 232-233",,"University History",,,,,,,2003,,,,,,,,,,"Permission to publish material from the Virginia Tech Black History Collection must be obtained from Special Collections, Virginia Tech.",,,,,,,,,,,,,,,,,,,,,Clippings,Bugle2003_pg232-233_SuggsAndJones,,,,,,,,,,,,,,,,,,,,,,,,,,,,,,,,,,,,,,,,,,,,,,,,,,,,,,,,,,,,,,,,,,,,,,,,,,,,,,,,,,,,,http://spec.lib.vt.edu/pickup/Omeka_upload/Bugle2003_pg232-233_SuggsAndJones.jpg,Document,"Black History at Virginia Tech - Athletics",1,0
"Larry Beale, Men's Basketball, the 1968 Bugle, pg 44",,"University History",,,,,,,1968,,,,,,,,,,"Permission to publish material from the Virginia Tech Black History Collection must be obtained from Special Collections, Virginia Tech.",,,,,,,,,,,,,,,,,,,,,Clippings,Bugle1968_pg44_LarryBeale,,,,,,,,,,,,,,,,,,,,,,,,,,,,,,,,,,,,,,,,,,,,,,,,,,,,,,,,,,,,,,,,,,,,,,,,,,,,,,,,,,,,,http://spec.lib.vt.edu/pickup/Omeka_upload/Bugle1968_pg44_LarryBeale.jpg,Document,"Black History at Virginia Tech - Athletics",1,0
"Larry Cooke, Men's Basketball, the 1975 Bugle, pg 295",,"University History",,,,,,,1975,,,,,,,,,,"Permission to publish material from the Virginia Tech Black History Collection must be obtained from Special Collections, Virginia Tech.",,,,,,,,,,,,,,,,,,,,,Photographs,Bugle1975_pg295_LarryCooke,,,,,,,,,,,,,,,,,,,,,,,,,,,,,,,,,,,,,,,,,,,,,,,,,,,,,,,,,,,,,,,,,,,,,,,,,,,,,,,,,,,,,http://spec.lib.vt.edu/pickup/Omeka_upload/Bugle1975_pg295_LarryCooke.jpg,Document,"Black History at Virginia Tech - Athletics",1,0
"Lee Suggs 1999 Athletic Profile, 1999 Media Book","Lee Suggs 1999 Athletic Profile from 1999 Media Book","University History",,,,,,,1999,,,,,,,,,,"Permission to publish material from the Virginia Tech Black History Collection must be obtained from Special Collections, Virginia Tech.",,,,,,,,,,,,,,,,,,,,,,Lee_Suggs_AP_1999,,,,,,,,,,,,,,,,,,,,,,,,,,,,,,,,,,,,,,,,,,,,,,,,,,,,,,,,,,,,,,,,,,,,,,,,,,,,,,,,,,,,,http://digitalsc.lib.vt.edu/files/original/79870d29904c4c0115b7f1528a64fa24.pdf,,"Black History at Virginia Tech - Athletics",1,0
"Lee Suggs Athletic Profile, 2000 Media Book",Lee_Suggs_AP_2000,"University History",,,,,,,2000,,,,,,,,,,"Permission to publish material from the Virginia Tech Black History Collection must be obtained from Special Collections, Virginia Tech.",,,,,,,,,,,,,,,,,,,,,,Lee_Suggs_AP_2000,,,,,,,,,,,,,,,,,,,,,,,,,,,,,,,,,,,,,,,,,,,,,,,,,,,,,,,,,,,,,,,,,,,,,,,,,,,,,,,,,,,,,http://digitalsc.lib.vt.edu/files/original/e39b289f08ab347b6e2b393423ee2822.pdf,,"Black History at Virginia Tech - Athletics",1,0
"Lee Suggs from 2004 Media Book, in the NFL",Lee_Suggs_NFL_2004,"University History",,,,,,,2004,,,,,,,,,,"Permission to publish material from the Virginia Tech Black History Collection must be obtained from Special Collections, Virginia Tech.",,,,,,,,,,,,,,,,,,,,,,Lee_Suggs_NFL_2004,,,,,,,,,,,,,,,,,,,,,,,,,,,,,,,,,,,,,,,,,,,,,,,,,,,,,,,,,,,,,,,,,,,,,,,,,,,,,,,,,,,,,http://digitalsc.lib.vt.edu/files/original/4a670c1438f023d771d7d3483f8a5d00.jpg,,"Black History at Virginia Tech - Athletics",1,0
"Lee Suggs, 2001",,"University History",,,,,,,2001,,,,,,,,,,"Permission to publish material from the Virginia Tech Black History Collection must be obtained from Special Collections, Virginia Tech.",,,,,,,,,,,,,,,,,,,,,Photographs,SuggsLee_2001Bugle_pg322,,,,,,,,,,,,,,,,,,,,,,,,,,,,,,,,,,,,,,,,,,,,,,,,,,,,,,,,,,,,,,,,,,,,,,,,,,,,,,,,,,,,,http://spec.lib.vt.edu/pickup/Omeka_upload/SuggsLee_2001Bugle_pg322.jpg,Document,"Black History at Virginia Tech - Athletics",1,0
"Lee Suggs. 2000 Media Book thumbnail, pg 103",Lee_Suggs_AT_2000_pg103,"University History",,,,,,,2000,,,,,,,,,,"Permission to publish material from the Virginia Tech Black History Collection must be obtained from Special Collections, Virginia Tech.",,,,,,,,,,,,,,,,,,,,,,Lee_Suggs_AT_2000_pg103,,,,,,,,,,,,,,,,,,,,,,,,,,,,,,,,,,,,,,,,,,,,,,,,,,,,,,,,,,,,,,,,,,,,,,,,,,,,,,,,,,,,,http://digitalsc.lib.vt.edu/files/original/06a7000f8c09e2caa14639e1bd7b451d.jpg,,"Black History at Virginia Tech - Athletics",1,0
"Lisa Leftwich, Women's Basketball, 1994",,"University History",,,,,,,1994,,,,,,,,,,"Permission to publish material from the Virginia Tech Black History Collection must be obtained from Special Collections, Virginia Tech.",,,,,,,,,,,,,,,,,,,,,Clippings,LeftwichLisa_1994,,,,,,,,,,,,,,,,,,,,,,,,,,,,,,,,,,,,,,,,,,,,,,,,,,,,,,,,,,,,,,,,,,,,,,,,,,,,,,,,,,,,,http://digitalsc.lib.vt.edu/files/original/46d8c04b5337cd70a01c890fe20a13a2.jpg,,"Black History at Virginia Tech - Athletics",1,0
"Maurice DeShazo and Antonio Freeman, 1993",,"University History",,,,,,,1993,,,,,,,,,,"Permission to publish material from the Virginia Tech Black History Collection must be obtained from Special Collections, Virginia Tech.",,,,,,,,,,,,,,,,,,,,,Clippings,DeShazoMaurice_AntonioFreeman_1993,,,,,,,,,,,,,,,,,,,,,,,,,,,,,,,,,,,,,,,,,,,,,,,,,,,,,,,,,,,,,,,,,,,,,,,,,,,,,,,,,,,,,http://spec.lib.vt.edu/pickup/Omeka_upload/DeShazoMaurice_AntonioFreeman_1993.jpg,Document,"Black History at Virginia Tech - Athletics",1,0
"Men's Track and Field, the 1980 Bugle, pg 162",,"University History",,,,,,,1980,,,,,,,,,,"Permission to publish material from the Virginia Tech Black History Collection must be obtained from Special Collections, Virginia Tech.",,,,,,,,,,,,,,,,,,,,,Clippings,Bugle1980_pg162_MensTrack,,,,,,,,,,,,,,,,,,,,,,,,,,,,,,,,,,,,,,,,,,,,,,,,,,,,,,,,,,,,,,,,,,,,,,,,,,,,,,,,,,,,,http://spec.lib.vt.edu/pickup/Omeka_upload/Bugle1980_pg162_MensTrack.jpg,Document,"Black History at Virginia Tech - Athletics",1,0
"Michael Vick 2000 Media Book Profile, pg 107-108",Michael_Vick_AP_2000,"University History",,,,,,,,,,,,,,,,,"Permission to publish material from the Virginia Tech Black History Collection must be obtained from Special Collections, Virginia Tech.",,,,,,,,,,,,,,,,,,,,,,Michael_Vick_AP_2000,,,,,,,,,,,,,,,,,,,,,,,,,,,,,,,,,,,,,,,,,,,,,,,,,,,,,,,,,,,,,,,,,,,,,,,,,,,,,,,,,,,,,http://digitalsc.lib.vt.edu/files/original/1603c0e5719fee228867b2703610ffff.pdf,,"Black History at Virginia Tech - Athletics",1,0
"Michael Vick_Profile Picture 2000 media book, pg 107",Michael_Vick_AT_2000_pg107,"University History",,,,,,,2000,,,,,,,,,,"Permission to publish material from the Virginia Tech Black History Collection must be obtained from Special Collections, Virginia Tech.",,,,,,,,,,,,,,,,,,,,,,Michael_Vick_AT_2000_pg107,,,,,,,,,,,,,,,,,,,,,,,,,,,,,,,,,,,,,,,,,,,,,,,,,,,,,,,,,,,,,,,,,,,,,,,,,,,,,,,,,,,,,http://digitalsc.lib.vt.edu/files/original/c858326e84e0462cb4c33b41aebad34d.jpg,,"Black History at Virginia Tech - Athletics",1,0
"Michael Vick, 2001",,"University History",,,,,,,2001,,,,,,,,,,"Permission to publish material from the Virginia Tech Black History Collection must be obtained from Special Collections, Virginia Tech.",,,,,,,,,,,,,,,,,,,,,Photographs,VickMichael_2001Bugle_pg318,,,,,,,,,,,,,,,,,,,,,,,,,,,,,,,,,,,,,,,,,,,,,,,,,,,,,,,,,,,,,,,,,,,,,,,,,,,,,,,,,,,,,http://spec.lib.vt.edu/pickup/Omeka_upload/VickMichael_2001Bugle_pg318.jpg,Document,"Black History at Virginia Tech - Athletics",1,0
"Mike Halim, Men's Soccer, the 1981 Bugle, pg 183",,"University History",,,,,,,1981,,,,,,,,,,"Permission to publish material from the Virginia Tech Black History Collection must be obtained from Special Collections, Virginia Tech.",,,,,,,,,,,,,,,,,,,,,Clippings,Bugle1981_pg183_Soccer,,,,,,,,,,,,,,,,,,,,,,,,,,,,,,,,,,,,,,,,,,,,,,,,,,,,,,,,,,,,,,,,,,,,,,,,,,,,,,,,,,,,,http://spec.lib.vt.edu/pickup/Omeka_upload/Bugle1981_pg183_Soccer.jpg,Document,"Black History at Virginia Tech - Athletics",1,0
"Mike Johnson, 1983 Maroon Book",,"University History",,,,,,,1983,,,,,,,,,,"Permission to publish material from the Virginia Tech Black History Collection must be obtained from Special Collections, Virginia Tech.",,,,,,,,,,,,,,,,,,,,,Clippings,JohnsonMike_MaroonBook_1983,,,,,,,,,,,,,,,,,,,,,,,,,,,,,,,,,,,,,,,,,,,,,,,,,,,,,,,,,,,,,,,,,,,,,,,,,,,,,,,,,,,,,http://spec.lib.vt.edu/pickup/Omeka_upload/JohnsonMike_MaroonBook_1983.jpg,Document,"Black History at Virginia Tech - Athletics",1,0
"Paul Adams, Men's Baseball, the 1977 Bugle, pg259",,"University History",,,,,,,1977,,,,,,,,,,"Permission to publish material from the Virginia Tech Black History Collection must be obtained from Special Collections, Virginia Tech.",,,,,,,,,,,,,,,,,,,,,Clippings,1977_Bugle_pg259_PaulAdams,,,,,,,,,,,,,,,,,,,,,,,,,,,,,,,,,,,,,,,,,,,,,,,,,,,,,,,,,,,,,,,,,,,,,,,,,,,,,,,,,,,,,http://spec.lib.vt.edu/pickup/Omeka_upload/1977_Bugle_pg259_PaulAdams.jpg,Document,"Black History at Virginia Tech - Athletics",1,0
"Phil Rogers, Men's Football, 1975",,"University History",,,,,,,1975,,,,,,,,,,"Permission to publish material from the Virginia Tech Black History Collection must be obtained from Special Collections, Virginia Tech.",,,,,,,,,,,,,,,,,,,,,Clippings,RogersPhil,,,,,,,,,,,,,,,,,,,,,,,,,,,,,,,,,,,,,,,,,,,,,,,,,,,,,,,,,,,,,,,,,,,,,,,,,,,,,,,,,,,,,http://spec.lib.vt.edu/pickup/Omeka_upload/RogersPhil.jpg,Document,"Black History at Virginia Tech - Athletics",1,0
"Phil Saunders, Men's Track and Field, the 1986 Bugle, pg 141",,"University History",,,,,,,1986,,,,,,,,,,"Permission to publish material from the Virginia Tech Black History Collection must be obtained from Special Collections, Virginia Tech.",,,,,,,,,,,,,,,,,,,,,Clippings,Bugle1986_pg141_PhilSaunders,,,,,,,,,,,,,,,,,,,,,,,,,,,,,,,,,,,,,,,,,,,,,,,,,,,,,,,,,,,,,,,,,,,,,,,,,,,,,,,,,,,,,http://spec.lib.vt.edu/pickup/Omeka_upload/Bugle1986_pg141_PhilSaunders.jpg,Document,"Black History at Virginia Tech - Athletics",1,0
"Queen Harrison",,"University History",,,,,,,,,,,,,,,,,"Permission to publish material from the Virginia Tech Black History Collection must be obtained from Special Collections, Virginia Tech.",,,,,,,,,,,,,,,,,,,,,Photographs,QueenHarrison,,,,,,,,,,,,,,,,,,,,,,,,,,,,,,,,,,,,,,,,,,,,,,,,,,,,,,,,,,,,,,,,,,,,,,,,,,,,,,,,,,,,,http://spec.lib.vt.edu/pickup/Omeka_upload/QueenHarrison.jpg,Document,"Black History at Virginia Tech - Athletics",1,0