﻿"Item Id","Item URI","Dublin Core:Title","Dublin Core:Alternative Title","Dublin Core:Subject","Dublin Core:Description","Dublin Core:Abstract","Dublin Core:Table Of Contents","Dublin Core:Creator","Dublin Core:Source","Dublin Core:Publisher","Dublin Core:Date","Dublin Core:Date Available","Dublin Core:Date Created","Dublin Core:Date Accepted","Dublin Core:Date Copyrighted","Dublin Core:Date Submitted","Dublin Core:Date Issued","Dublin Core:Date Modified","Dublin Core:Date Valid","Dublin Core:Contributor","Dublin Core:Rights","Dublin Core:Access Rights","Dublin Core:License","Dublin Core:Relation","Dublin Core:Conforms To","Dublin Core:Has Format","Dublin Core:Has Part","Dublin Core:Has Version","Dublin Core:Is Format Of","Dublin Core:Is Part Of","Dublin Core:Is Referenced By","Dublin Core:Is Replaced By","Dublin Core:Is Required By","Dublin Core:Is Version Of","Dublin Core:References","Dublin Core:Replaces","Dublin Core:Requires","Dublin Core:Format","Dublin Core:Extent","Dublin Core:Medium","Dublin Core:Language","Dublin Core:Type","Dublin Core:Identifier","Dublin Core:Bibliographic Citation","Dublin Core:Coverage","Dublin Core:Spatial Coverage","Dublin Core:Temporal Coverage","Dublin Core:Accrual Method","Dublin Core:Accrual Periodicity","Dublin Core:Accrual Policy","Dublin Core:Audience","Dublin Core:Audience Education Level","Dublin Core:Mediator","Dublin Core:Instructional Method","Dublin Core:Provenance","Dublin Core:Rights Holder","Item Type Metadata:Text","Item Type Metadata:Interviewer","Item Type Metadata:Interviewee","Item Type Metadata:Location","Item Type Metadata:Transcription","Item Type Metadata:Local URL","Item Type Metadata:Original Format","Item Type Metadata:Physical Dimensions","Item Type Metadata:Duration","Item Type Metadata:Compression","Item Type Metadata:Producer","Item Type Metadata:Director","Item Type Metadata:Bit Rate/Frequency","Item Type Metadata:Time Summary","Item Type Metadata:Email Body","Item Type Metadata:Subject Line","Item Type Metadata:From","Item Type Metadata:To","Item Type Metadata:CC","Item Type Metadata:BCC","Item Type Metadata:Number of Attachments","Item Type Metadata:Standards","Item Type Metadata:Objectives","Item Type Metadata:Materials","Item Type Metadata:Lesson Plan Text","Item Type Metadata:URL","Item Type Metadata:Event Type","Item Type Metadata:Participants","Item Type Metadata:Birth Date","Item Type Metadata:Birthplace","Item Type Metadata:Death Date","Item Type Metadata:Occupation","Item Type Metadata:Biographical Text","Item Type Metadata:Bibliography","Item Type Metadata:Transcript","Item Type Metadata:Viewer","Item Type Metadata:Narrator","Item Type Metadata:Production Team","Item Type Metadata:Display Resolution","Item Type Metadata:Frame Rate","Item Type Metadata:Player","Omeka Legacy File:Additional Creator","Omeka Legacy File:Transcriber","Omeka Legacy File:Producer","Omeka Legacy File:Render Device","Omeka Legacy File:Render Details","Omeka Legacy File:Capture Date","Omeka Legacy File:Capture Device","Omeka Legacy File:Capture Details","Omeka Legacy File:Change History","Omeka Legacy File:Watermark","Omeka Legacy File:Encryption","Omeka Legacy File:Compression","Omeka Legacy File:Post Processing","Omeka Image File:Width","Omeka Image File:Height","Omeka Image File:Bit Depth","Omeka Image File:Channels","Omeka Image File:Exif String","Omeka Image File:Exif Array","Omeka Image File:IPTC String","Omeka Image File:IPTC Array","Omeka Video File:Bitrate","Omeka Video File:Duration","Omeka Video File:Sample Rate","Omeka Video File:Codec","Omeka Video File:Width","Omeka Video File:Height","PDF Text:Text",tags,file,itemType,collection,public,featured
18028,https://digitalsc.lib.vt.edu/items/show/18028,"Ash, William Letter",,,"Letter from William Ash to his cousins. ",,,"Ash, William","<a href=""https://aspace.lib.vt.edu/repositories/2/resources/2869"" target=""_blank"" rel=""noreferrer noopener"">Alexandria and Fairfax Counties [Virginia] Civil War Correspondence</a>, Special Collections and University Archives, Virginia Tech, Blacksburg, Va.",,1861-12-22,,,,,,,,,,"<a href=""http://rightsstatements.org/vocab/CNE/1.0/"" target=""_blank"" rel=""noreferrer noopener"">http://rightsstatements.org/vocab/CNE/1.0/</a>",,,,,,,,,"Box: 1, Folder: 16",,,,,,,,,,,English,,Acc2017-239_AshWilliam_Letter_1861_1222a,"[identification of item], Alexandria and Fairfax Counties [Virginia] Civil War Correspondence, Ms2013-029, Special Collections and University Archives, Virginia Tech, Blacksburg, Va.",,,,,,,,,,,,,,,,,,,,,,,,,,,,,,,,,,,,,,,,,,,,,,,,,,,,,,,,,,,,,,,,,,,,,,,,,,,,,,,,,,,"https://digitalsc.lib.vt.edu/files/original/8982c6aca05da6cb7747941d3a11e01f.jpg,https://digitalsc.lib.vt.edu/files/original/7d6279a93022477d4238b853aafe510b.jpg,https://digitalsc.lib.vt.edu/files/original/900d7a34139f25adf2e6c10fbc683269.jpg,https://digitalsc.lib.vt.edu/files/original/4a189a96febc56c8c05c51ceae7039a7.jpg","Still Image","Alexandria and Fairfax Counties [Virginia] Civil War Correspondence, 1861-1862 (Ms2013-029)",1,0
18029,https://digitalsc.lib.vt.edu/items/show/18029,"Ash, William Envelope",,,"Envelope of a letter from William Ash to his cousins.",,,"Ash, William","<a href=""https://aspace.lib.vt.edu/repositories/2/resources/2869"" target=""_blank"" rel=""noreferrer noopener"">Alexandria and Fairfax Counties [Virginia] Civil War Correspondence</a>, Special Collections and University Archives, Virginia Tech, Blacksburg, Va.",,1861-12-22,,,,,,,,,,"<a href=""http://rightsstatements.org/vocab/CNE/1.0/"" target=""_blank"" rel=""noreferrer noopener"">http://rightsstatements.org/vocab/CNE/1.0/</a>",,,,,,,,,"Box: 1, Folder: 16",,,,,,,,,,,English,,Acc2017-239_AshWilliam_Letter_1861_1222env,"[identification of item], Alexandria and Fairfax Counties [Virginia] Civil War Correspondence, Ms2013-029, Special Collections and University Archives, Virginia Tech, Blacksburg, Va.",,,,,,,,,,,,,,,,,,,,,,,,,,,,,,,,,,,,,,,,,,,,,,,,,,,,,,,,,,,,,,,,,,,,,,,,,,,,,,,,,,,https://digitalsc.lib.vt.edu/files/original/4bb2f456fb38f4c080cdf16a5c85ea38.jpg,"Still Image","Alexandria and Fairfax Counties [Virginia] Civil War Correspondence, 1861-1862 (Ms2013-029)",1,0
2448,https://digitalsc.lib.vt.edu/items/show/2448,"Alexandria and Fairfax Counties [Virginia] Civil War Correspondence, 1861-1862 (Ms2013-029), J. T. Baskin Letter, October 3, 1861",,"Civil War","Letter from J. T. Baskin to his sister, describing Yankee forces and camp life.",,,"Baskin, J. T. ","<a href=""http://ead.lib.virginia.edu/vivaxtf/view?docId=vt/viblbv01265.xml"">Alexandria and Fairfax Counties [Virginia] Civil War Correspondence</a>","Special Collections, University Libraries, Virginia Tech ",1861-10-03,,,,,1/20/2014,,,,kad,"Permission to publish material from the Alexandria and Fairfax Counties [Virginia] Civil War Correspondence, Ms2013-029 must be obtained from Special Collections, Virginia Tech.","Collection is open to research.",,,,,,,,"Box 1, Folder 1",,,,,,,,,,,English,Letters,Ms2013_029_Alexandria_Baskin,"Alexandria and Fairfax Counties [Virginia] Civil War Correspondence, Ms2013-029 - Special Collections, Virginia Tech, Blacksburg, Va.",,,,,,,,,,,,"Special Collections, University Libraries, Virginia Tech ",,,,,,,,,,,,,,,,,,,,,,,,,,,,,,,,,,,,,,,,,,,,,,,,,,,,,,,,,,,,,,,,,,,,,,"Civil War","http://spec.lib.vt.edu/pickup/Ms2013_029_Alexandria_complete_jpgs/Ms2013_029_Alexandria_Baskin_1861_1003a.jpg,http://spec.lib.vt.edu/pickup/Ms2013_029_Alexandria_complete_jpgs/Ms2013_029_Alexandria_Baskin_1861_1003b.jpg,http://spec.lib.vt.edu/pickup/Ms2013_029_Alexandria_complete_jpgs/Ms2013_029_Alexandria_Baskin_1861_1003c.jpg,http://spec.lib.vt.edu/pickup/Ms2013_029_Alexandria_complete_jpgs/Ms2013_029_Alexandria_Baskin_1861_1003d.jpg,http://spec.lib.vt.edu/pickup/Ms2013_029_Alexandria_complete_jpgs/Ms2013_029_Alexandria_Baskin_1861_1003_transcript.jpg","Still Image","Alexandria and Fairfax Counties [Virginia] Civil War Correspondence, 1861-1862 (Ms2013-029)",1,0
2450,https://digitalsc.lib.vt.edu/items/show/2450,"Alexandria and Fairfax Counties [Virginia] Civil War Correspondence, 1861-1862 (Ms2013-029), Henry Cole Letter, August 2, 1861",,"Civil War","Letter from Henry Cole to his sister Annie talking about food rations, weather, and camp duties.",,,"Cole, Henry","<a href=""http://ead.lib.virginia.edu/vivaxtf/view?docId=vt/viblbv01265.xml"">Alexandria and Fairfax Counties [Virginia] Civil War Correspondence</a>","Special Collections, University Libraries, Virginia Tech ",1861-08-02,,,,,1/22/2014,,,,kad,"Permission to publish material from the Alexandria and Fairfax Counties [Virginia] Civil War Correspondence, Ms2013-029 must be obtained from Special Collections, Virginia Tech.","Collection is open to research.",,,,,,,,"Box 1, Folder 2",,,,,,,,,,,English,Letters,Ms2013_029_Alexandria_Cole(H)_1861_0802,"Alexandria and Fairfax Counties [Virginia] Civil War Correspondence, Ms2013-029 - Special Collections, Virginia Tech, Blacksburg, Va.",,,,,,,,,,,,"Special Collections, University Libraries, Virginia Tech ",,,,,,,,,,,,,,,,,,,,,,,,,,,,,,,,,,,,,,,,,,,,,,,,,,,,,,,,,,,,,,,,,,,,,,,"http://spec.lib.vt.edu/pickup/Ms2013_029_Alexandria_complete_jpgs/Ms2013_029_Alexandria_Cole(H)_1861_0802a.jpg,http://spec.lib.vt.edu/pickup/Ms2013_029_Alexandria_complete_jpgs/Ms2013_029_Alexandria_Cole(H)_1861_0802b.jpg,http://spec.lib.vt.edu/pickup/Ms2013_029_Alexandria_complete_jpgs/Ms2013_029_Alexandria_Cole(H)_1861_0802c.jpg,http://spec.lib.vt.edu/pickup/Ms2013_029_Alexandria_complete_jpgs/Ms2013_029_Alexandria_Cole(H)_1861_0802d.jpg,http://spec.lib.vt.edu/pickup/Ms2013_029_Alexandria_complete_jpgs/Ms2013_029_Alexandria_Cole(H)_1861_0802_transcript.jpg","Still Image","Alexandria and Fairfax Counties [Virginia] Civil War Correspondence, 1861-1862 (Ms2013-029)",1,0
2451,https://digitalsc.lib.vt.edu/items/show/2451,"Alexandria and Fairfax Counties [Virginia] Civil War Correspondence, 1861-1862 (Ms2013-029), Henry Cole Letter, October 9, 1861",,"Civil War","Letter from Henry Cole to his sister Annie describing his current location, the landscape, and the contents of his backpack.",,,"Cole, Henry","<a href=""http://ead.lib.virginia.edu/vivaxtf/view?docId=vt/viblbv01265.xml"">Alexandria and Fairfax Counties [Virginia] Civil War Correspondence</a>","Special Collections, University Libraries, Virginia Tech ",1861-10-09,,,,,1/23/2014,,,,kad,"Permission to publish material from the Alexandria and Fairfax Counties [Virginia] Civil War Correspondence, Ms2013-029 must be obtained from Special Collections, Virginia Tech.","Collection is open to research.",,,,,,,,"Box 1, Folder 2",,,,,,,,,,,English,Letters,Ms2013_029_Alexandria_Cole(H)_1861_1002,"Alexandria and Fairfax Counties [Virginia] Civil War Correspondence, Ms2013-029 - Special Collections, Virginia Tech, Blacksburg, Va.",,,,,,,,,,,,"Special Collections, University Libraries, Virginia Tech ",,,,,,,,,,,,,,,,,,,,,,,,,,,,,,,,,,,,,,,,,,,,,,,,,,,,,,,,,,,,,,,,,,,,,,,"http://spec.lib.vt.edu/pickup/Ms2013_029_Alexandria_complete_jpgs/Ms2013_029_Alexandria_Cole(H)_1861_1002a.jpg,http://spec.lib.vt.edu/pickup/Ms2013_029_Alexandria_complete_jpgs/Ms2013_029_Alexandria_Cole(H)_1861_1002b.jpg,http://spec.lib.vt.edu/pickup/Ms2013_029_Alexandria_complete_jpgs/Ms2013_029_Alexandria_Cole(H)_1861_1002c.jpg,http://spec.lib.vt.edu/pickup/Ms2013_029_Alexandria_complete_jpgs/Ms2013_029_Alexandria_Cole(H)_1861_1002d.jpg,http://spec.lib.vt.edu/pickup/Ms2013_029_Alexandria_complete_jpgs/Ms2013_029_Alexandria_Cole(H)_1861_1002_transcript.jpg","Still Image","Alexandria and Fairfax Counties [Virginia] Civil War Correspondence, 1861-1862 (Ms2013-029)",1,0
2449,https://digitalsc.lib.vt.edu/items/show/2449,"Alexandria and Fairfax Counties [Virginia] Civil War Correspondence, 1861-1862 (Ms2013-029), Henry and Luther Cole Letter, August 2, 1861",,"Civil War","Letter from brothers Henry and Luther Cole to sister Annie, describing camp life and their cabin.",,,"Cole, Henry; Cole, Luther","<a href=""http://ead.lib.virginia.edu/vivaxtf/view?docId=vt/viblbv01265.xml"">Alexandria and Fairfax Counties [Virginia] Civil War Correspondence</a>","Special Collections, University Libraries, Virginia Tech ",1861-08-02,,,,,1/21/2014,,,,kad,"Permission to publish material from the Alexandria and Fairfax Counties [Virginia] Civil War Correspondence, Ms2013-029 must be obtained from Special Collections, Virginia Tech.","Collection is open to research.",,,,,,,,"Box 1, Folder 2",,,,,,,,,,,English,Letters,Ms2013_029_Alexandria_Cole(H+L),"Alexandria and Fairfax Counties [Virginia] Civil War Correspondence, Ms2013-029 - Special Collections, Virginia Tech, Blacksburg, Va.",,,,,,,,,,,,"Special Collections, University Libraries, Virginia Tech ",,,,,,,,,,,,,,,,,,,,,,,,,,,,,,,,,,,,,,,,,,,,,,,,,,,,,,,,,,,,,,,,,,,,,,,"http://spec.lib.vt.edu/pickup/Ms2013_029_Alexandria_complete_jpgs/Ms2013_029_Alexandria_Cole(H L)_1861_0802a.jpg,http://spec.lib.vt.edu/pickup/Ms2013_029_Alexandria_complete_jpgs/Ms2013_029_Alexandria_Cole(H L)_1861_0802b.jpg,http://spec.lib.vt.edu/pickup/Ms2013_029_Alexandria_complete_jpgs/Ms2013_029_Alexandria_Cole(H L)_1861_0802c.jpg,http://spec.lib.vt.edu/pickup/Ms2013_029_Alexandria_complete_jpgs/Ms2013_029_Alexandria_Cole(H L)_1861_0802d.jpg,http://spec.lib.vt.edu/pickup/Ms2013_029_Alexandria_complete_jpgs/Ms2013_029_Alexandria_Cole(H L)_1861_0802_transcript.jpg","Still Image","Alexandria and Fairfax Counties [Virginia] Civil War Correspondence, 1861-1862 (Ms2013-029)",1,0
2452,https://digitalsc.lib.vt.edu/items/show/2452,"Alexandria and Fairfax Counties [Virginia] Civil War Correspondence, 1861-1862 (Ms2013-029), George E. Davis Letter, March 19, 1862",,"Civil War","Letter from George E. Davis to his parents, including his intent to send money when he is paid and moving of his regiment's camp.",,,"Davis, George E.","<a href=""http://ead.lib.virginia.edu/vivaxtf/view?docId=vt/viblbv01265.xml"">Alexandria and Fairfax Counties [Virginia] Civil War Correspondence</a>","Special Collections, University Libraries, Virginia Tech ",1862-03-19,,,,,1/24/2014,,,,kad,"Permission to publish material from the Alexandria and Fairfax Counties [Virginia] Civil War Correspondence, Ms2013-029 must be obtained from Special Collections, Virginia Tech.","Collection is open to research.",,,,,,,,"Box 1, Folder 3",,,,,,,,,,,English,Letters,Ms2013_029_Alexandria_Davis,"Alexandria and Fairfax Counties [Virginia] Civil War Correspondence, Ms2013-029 - Special Collections, Virginia Tech, Blacksburg, Va.",,,,,,,,,,,,"Special Collections, University Libraries, Virginia Tech ",,,,,,,,,,,,,,,,,,,,,,,,,,,,,,,,,,,,,,,,,,,,,,,,,,,,,,,,,,,,,,,,,,,,,,,"http://spec.lib.vt.edu/pickup/Ms2013_029_Alexandria_complete_jpgs/Ms2013_029_Alexandria_Davis_1861_0319a.jpg,http://spec.lib.vt.edu/pickup/Ms2013_029_Alexandria_complete_jpgs/Ms2013_029_Alexandria_Davis_1861_0319b.jpg,http://spec.lib.vt.edu/pickup/Ms2013_029_Alexandria_complete_jpgs/Ms2013_029_Alexandria_Davis_1861_0319c.jpg,http://spec.lib.vt.edu/pickup/Ms2013_029_Alexandria_complete_jpgs/Ms2013_029_Alexandria_Davis_1861_0319d.jpg,http://spec.lib.vt.edu/pickup/Ms2013_029_Alexandria_complete_jpgs/Ms2013_029_Alexandria_Davis_1861_0319_transcripta.jpg,http://spec.lib.vt.edu/pickup/Ms2013_029_Alexandria_complete_jpgs/Ms2013_029_Alexandria_Davis_1861_0319_transcriptb.jpg","Still Image","Alexandria and Fairfax Counties [Virginia] Civil War Correspondence, 1861-1862 (Ms2013-029)",1,0
2453,https://digitalsc.lib.vt.edu/items/show/2453,"Alexandria and Fairfax Counties [Virginia] Civil War Correspondence, 1861-1862 (Ms2013-029), William D. Dixon Letter, November 20, 1861",,"Civil War","Letter from William Dixon to his wife, Martha, describing the weather, that he has sent her money, and his hopes to return home soon.",,,"Dixon, William D.","<a href=""http://ead.lib.virginia.edu/vivaxtf/view?docId=vt/viblbv01265.xml"">Alexandria and Fairfax Counties [Virginia] Civil War Correspondence</a>","Special Collections, University Libraries, Virginia Tech ",1861-11-20,,,,,1/25/2014,,,,kad,"Permission to publish material from the Alexandria and Fairfax Counties [Virginia] Civil War Correspondence, Ms2013-029 must be obtained from Special Collections, Virginia Tech.","Collection is open to research.",,,,,,,,"Box 1, Folder 4",,,,,,,,,,,English,Letters,Ms2013_029_Alexandria_Dixon,"Alexandria and Fairfax Counties [Virginia] Civil War Correspondence, Ms2013-029 - Special Collections, Virginia Tech, Blacksburg, Va.",,,,,,,,,,,,"Special Collections, University Libraries, Virginia Tech ",,,,,,,,,,,,,,,,,,,,,,,,,,,,,,,,,,,,,,,,,,,,,,,,,,,,,,,,,,,,,,,,,,,,,,,"http://spec.lib.vt.edu/pickup/Ms2013_029_Alexandria_complete_jpgs/Ms2013_029_Alexandria_Dixon_1861_1120a.jpg,http://spec.lib.vt.edu/pickup/Ms2013_029_Alexandria_complete_jpgs/Ms2013_029_Alexandria_Dixon_1861_1120b.jpg,http://spec.lib.vt.edu/pickup/Ms2013_029_Alexandria_complete_jpgs/Ms2013_029_Alexandria_Dixon_1861_1120c.jpg,http://spec.lib.vt.edu/pickup/Ms2013_029_Alexandria_complete_jpgs/Ms2013_029_Alexandria_Dixon_1861_1120d.jpg,http://spec.lib.vt.edu/pickup/Ms2013_029_Alexandria_complete_jpgs/Ms2013_029_Alexandria_Dixon_1861_1120_transcript.jpg","Still Image","Alexandria and Fairfax Counties [Virginia] Civil War Correspondence, 1861-1862 (Ms2013-029)",1,0
18031,https://digitalsc.lib.vt.edu/items/show/18031,"Edwards, Clarke S. Letter September 29, 1861",,,"Letter from Edwards to ""My Dear Wife."" ",,,"Edwards, Clarke S.","<a href=""https://aspace.lib.vt.edu/repositories/2/resources/2869"" target=""_blank"" rel=""noreferrer noopener"">Alexandria and Fairfax Counties [Virginia] Civil War Correspondence</a>, Special Collections and University Archives, Virginia Tech, Blacksburg, Va.",,1861-09-29,,,,,,,,,,"<a href=""http://rightsstatements.org/vocab/CNE/1.0/"" target=""_blank"" rel=""noreferrer noopener"">http://rightsstatements.org/vocab/CNE/1.0/</a>",,,,,,,,,"Box: 1. Folder: 17",,,,,,,,,,,English,,Acc2017-239_EdwardsClarkeS_Letter_1861_0929a,"[identification of item], Alexandria and Fairfax Counties [Virginia] Civil War Correspondence, Ms2013-029, Special Collections and University Archives, Virginia Tech, Blacksburg, Va.",,,,,,,,,,,,,,,,,,,,,,,,,,,,,,,,,,,,,,,,,,,,,,,,,,,,,,,,,,,,,,,,,,,,,,,,,,,,,,,,,,,"https://digitalsc.lib.vt.edu/files/original/e6cf88356e8c85b2ec9ee183a9231e3b.jpg,https://digitalsc.lib.vt.edu/files/original/c23bb04cbf9d6385a7db64e78f13c721.jpg,https://digitalsc.lib.vt.edu/files/original/4fffb6a7d7f7c61db0f1e2d350b1ca1b.jpg,https://digitalsc.lib.vt.edu/files/original/08e0405c8ffbd7385c0cbeae09ecc240.jpg","Still Image","Alexandria and Fairfax Counties [Virginia] Civil War Correspondence, 1861-1862 (Ms2013-029)",1,0
18032,https://digitalsc.lib.vt.edu/items/show/18032,"Edwards, Clarke S. Letter September 1861 Envelope",,,"Envelope from the September 1861 letter from Edwards to his wife.",,,"Edwards, Clarke S.","<a href=""https://aspace.lib.vt.edu/repositories/2/resources/2869"" target=""_blank"" rel=""noreferrer noopener"">Alexandria and Fairfax Counties [Virginia] Civil War Correspondence</a>, Special Collections and University Archives, Virginia Tech, Blacksburg, Va.",,1861-09-29,,,,,,,,,,"<a href=""http://rightsstatements.org/vocab/CNE/1.0/"" target=""_blank"" rel=""noreferrer noopener"">http://rightsstatements.org/vocab/CNE/1.0/</a>",,,,,,,,,"Box: 1. Folder: 17",,,,,,,,,,,English,,Acc2017-239_EdwardsClarkeS_Letter_1861_0929env,"[identification of item], Alexandria and Fairfax Counties [Virginia] Civil War Correspondence, Ms2013-029, Special Collections and University Archives, Virginia Tech, Blacksburg, Va.",,,,,,,,,,,,,,,,,,,,,,,,,,,,,,,,,,,,,,,,,,,,,,,,,,,,,,,,,,,,,,,,,,,,,,,,,,,,,,,,,,,https://digitalsc.lib.vt.edu/files/original/8aeb213b5ac9fc3a9ab1a1951e251396.jpg,"Still Image","Alexandria and Fairfax Counties [Virginia] Civil War Correspondence, 1861-1862 (Ms2013-029)",1,0
18033,https://digitalsc.lib.vt.edu/items/show/18033,"Edwards, Clarke S. Letter Oct. 22, 1861",,,"Letter from Edwards to his wife.",,,"Edwards, Clarke S.","<a href=""https://aspace.lib.vt.edu/repositories/2/resources/2869"" target=""_blank"" rel=""noreferrer noopener"">Alexandria and Fairfax Counties [Virginia] Civil War Correspondence</a>, Special Collections and University Archives, Virginia Tech, Blacksburg, Va.",,1861-10-22,,,,,,,,,,"<a href=""http://rightsstatements.org/vocab/CNE/1.0/"" target=""_blank"" rel=""noreferrer noopener"">http://rightsstatements.org/vocab/CNE/1.0/</a>",,,,,,,,,"Box: 1. Folder: 17",,,,,,,,,,,English,,Acc2017-239_EdwardsClarkeS_Letter_1861_1022a,"[identification of item], Alexandria and Fairfax Counties [Virginia] Civil War Correspondence, Ms2013-029, Special Collections and University Archives, Virginia Tech, Blacksburg, Va.",,,,,,,,,,,,,,,,,,,,,,,,,,,,,,,,,,,,,,,,,,,,,,,,,,,,,,,,,,,,,,,,,,,,,,,,,,,,,,,,,,,"https://digitalsc.lib.vt.edu/files/original/6b0000f4ad81583902bc8a2560e787a0.jpg,https://digitalsc.lib.vt.edu/files/original/855e8b6b8fd517b13057558661c0d093.jpg,https://digitalsc.lib.vt.edu/files/original/f35912ff183870c262ed5acb66ba9c84.jpg","Still Image","Alexandria and Fairfax Counties [Virginia] Civil War Correspondence, 1861-1862 (Ms2013-029)",1,0
18034,https://digitalsc.lib.vt.edu/items/show/18034,"Edwards, Clarke S. Letter Oct. 25, 1861",,,"Letter from Edwards to his wife.",,,"Edwards, Clarke S.","<a href=""https://aspace.lib.vt.edu/repositories/2/resources/2869"" target=""_blank"" rel=""noreferrer noopener"">Alexandria and Fairfax Counties [Virginia] Civil War Correspondence</a>, Special Collections and University Archives, Virginia Tech, Blacksburg, Va.",,1861-10-25,,,,,,,,,,"<a href=""http://rightsstatements.org/vocab/CNE/1.0/"" target=""_blank"" rel=""noreferrer noopener"">http://rightsstatements.org/vocab/CNE/1.0/</a>",,,,,,,,,"Box: 1. Folder: 17",,,,,,,,,,,English,,Acc2017-239_EdwardsClarkeS_Letter_1861_1025a,"[identification of item], Alexandria and Fairfax Counties [Virginia] Civil War Correspondence, Ms2013-029, Special Collections and University Archives, Virginia Tech, Blacksburg, Va.",,,,,,,,,,,,,,,,,,,,,,,,,,,,,,,,,,,,,,,,,,,,,,,,,,,,,,,,,,,,,,,,,,,,,,,,,,,,,,,,,,,"https://digitalsc.lib.vt.edu/files/original/ec67373a50b78b3a8782728398b6eedb.jpg,https://digitalsc.lib.vt.edu/files/original/5d221fb5f5042104b30f8530cc67b2e1.jpg,https://digitalsc.lib.vt.edu/files/original/b4c0b9cf4ba269a5713ba8dcfd2b098b.jpg","Still Image","Alexandria and Fairfax Counties [Virginia] Civil War Correspondence, 1861-1862 (Ms2013-029)",1,0
2454,https://digitalsc.lib.vt.edu/items/show/2454,"Alexandria and Fairfax Counties [Virginia] Civil War Correspondence, 1861-1862 (Ms2013-029), C. E. Gerry Letter, September 22, 1861",,"Civil War","Letter from Gerry to his friend, George, describing others in his regiment and asking for a return reply.",,,"Gerry, C. E.","<a href=""http://ead.lib.virginia.edu/vivaxtf/view?docId=vt/viblbv01265.xml"">Alexandria and Fairfax Counties [Virginia] Civil War Correspondence</a>","Special Collections, University Libraries, Virginia Tech ",1861-09-22,,,,,1/26/2014,,,,kad,"Permission to publish material from the Alexandria and Fairfax Counties [Virginia] Civil War Correspondence, Ms2013-029 must be obtained from Special Collections, Virginia Tech.","Collection is open to research.",,,,,,,,"Box 1, Folder 5",,,,,,,,,,,English,Letters,Ms2013_029_Alexandria_Gerry,"Alexandria and Fairfax Counties [Virginia] Civil War Correspondence, Ms2013-029 - Special Collections, Virginia Tech, Blacksburg, Va.",,,,,,,,,,,,"Special Collections, University Libraries, Virginia Tech ",,,,,,,,,,,,,,,,,,,,,,,,,,,,,,,,,,,,,,,,,,,,,,,,,,,,,,,,,,,,,,,,,,,,,,,"http://spec.lib.vt.edu/pickup/Ms2013_029_Alexandria_complete_jpgs/Ms2013_029_Alexandria_Gerry_1861_09(--).jpg,http://spec.lib.vt.edu/pickup/Ms2013_029_Alexandria_complete_jpgs/Ms2013_029_Alexandria_Gerry_1861_09(--)_transcript.jpg","Still Image","Alexandria and Fairfax Counties [Virginia] Civil War Correspondence, 1861-1862 (Ms2013-029)",1,0