﻿"Item Id","Item URI","Dublin Core:Title","Dublin Core:Alternative Title","Dublin Core:Subject","Dublin Core:Description","Dublin Core:Abstract","Dublin Core:Table Of Contents","Dublin Core:Creator","Dublin Core:Source","Dublin Core:Publisher","Dublin Core:Date","Dublin Core:Date Available","Dublin Core:Date Created","Dublin Core:Date Accepted","Dublin Core:Date Copyrighted","Dublin Core:Date Submitted","Dublin Core:Date Issued","Dublin Core:Date Modified","Dublin Core:Date Valid","Dublin Core:Contributor","Dublin Core:Rights","Dublin Core:Access Rights","Dublin Core:License","Dublin Core:Relation","Dublin Core:Conforms To","Dublin Core:Has Format","Dublin Core:Has Part","Dublin Core:Has Version","Dublin Core:Is Format Of","Dublin Core:Is Part Of","Dublin Core:Is Referenced By","Dublin Core:Is Replaced By","Dublin Core:Is Required By","Dublin Core:Is Version Of","Dublin Core:References","Dublin Core:Replaces","Dublin Core:Requires","Dublin Core:Format","Dublin Core:Extent","Dublin Core:Medium","Dublin Core:Language","Dublin Core:Type","Dublin Core:Identifier","Dublin Core:Bibliographic Citation","Dublin Core:Coverage","Dublin Core:Spatial Coverage","Dublin Core:Temporal Coverage","Dublin Core:Accrual Method","Dublin Core:Accrual Periodicity","Dublin Core:Accrual Policy","Dublin Core:Audience","Dublin Core:Audience Education Level","Dublin Core:Mediator","Dublin Core:Instructional Method","Dublin Core:Provenance","Dublin Core:Rights Holder","Item Type Metadata:Text","Item Type Metadata:Interviewer","Item Type Metadata:Interviewee","Item Type Metadata:Location","Item Type Metadata:Transcription","Item Type Metadata:Local URL","Item Type Metadata:Original Format","Item Type Metadata:Physical Dimensions","Item Type Metadata:Duration","Item Type Metadata:Compression","Item Type Metadata:Producer","Item Type Metadata:Director","Item Type Metadata:Bit Rate/Frequency","Item Type Metadata:Time Summary","Item Type Metadata:Email Body","Item Type Metadata:Subject Line","Item Type Metadata:From","Item Type Metadata:To","Item Type Metadata:CC","Item Type Metadata:BCC","Item Type Metadata:Number of Attachments","Item Type Metadata:Standards","Item Type Metadata:Objectives","Item Type Metadata:Materials","Item Type Metadata:Lesson Plan Text","Item Type Metadata:URL","Item Type Metadata:Event Type","Item Type Metadata:Participants","Item Type Metadata:Birth Date","Item Type Metadata:Birthplace","Item Type Metadata:Death Date","Item Type Metadata:Occupation","Item Type Metadata:Biographical Text","Item Type Metadata:Bibliography","Item Type Metadata:Transcript","Item Type Metadata:Viewer","Item Type Metadata:Narrator","Item Type Metadata:Production Team","Item Type Metadata:Display Resolution","Item Type Metadata:Frame Rate","Item Type Metadata:Player","Omeka Legacy File:Additional Creator","Omeka Legacy File:Transcriber","Omeka Legacy File:Producer","Omeka Legacy File:Render Device","Omeka Legacy File:Render Details","Omeka Legacy File:Capture Date","Omeka Legacy File:Capture Device","Omeka Legacy File:Capture Details","Omeka Legacy File:Change History","Omeka Legacy File:Watermark","Omeka Legacy File:Encryption","Omeka Legacy File:Compression","Omeka Legacy File:Post Processing","Omeka Image File:Width","Omeka Image File:Height","Omeka Image File:Bit Depth","Omeka Image File:Channels","Omeka Image File:Exif String","Omeka Image File:Exif Array","Omeka Image File:IPTC String","Omeka Image File:IPTC Array","Omeka Video File:Bitrate","Omeka Video File:Duration","Omeka Video File:Sample Rate","Omeka Video File:Codec","Omeka Video File:Width","Omeka Video File:Height","PDF Text:Text",tags,file,itemType,collection,public,featured
4040,https://digitalsc.lib.vt.edu/items/show/4040,"New System of Domestic Cookery: Founded Upon Principles of Economy",,"History of Food and Drink","274 pages",,,"Rundell, Maria E.","History of Food and Drink Collection, Special Collections, University Libraries, Virginia Tech","Philadelphia: Carey and Hart",1844,,,,,,,,,,"In the public domain.",,,,,,,,,,,,,,,,,,,,,Books,TX715.R94_1844b,,,,,,,,,,,,,,,,,,,,,,,,,,,,,,,,,,,,,,,,,,,,,,,,,PDF,,,,,,,,,,,,,,,,,,,,,,,,,,,,,,,,,,,https://digitalsc.lib.vt.edu/files/original/4040/TX715.R94_1844b.pdf,Document,"History of Food & Drink Collection Rare Books & Publications",1,0
4039,https://digitalsc.lib.vt.edu/items/show/4039,"A Laboratory Handbook for Dietitics",,"History of Food and Drink","156 pages",,,"Rose, Mary Swartz","History of Food and Drink Collection, Special Collections, University Libraries, Virginia Tech","New York: The Macmillan Company",1921,,,,,,,,,,"In the public domain.",,,,,,,,,,,,,,,,,,,,,Books,TX551.R7_1921,,,,,,,,,,,,,,,,,,,,,,,,,,,,,,,,,,,,,,,,,,,,,,,,,PDF,,,,,,,,,,,,,,,,,,,,,,,,,,,,,,,,,,,https://digitalsc.lib.vt.edu/files/original/4039/TX551.R7_1921.pdf,Document,"History of Food & Drink Collection Rare Books & Publications",1,0
4036,https://digitalsc.lib.vt.edu/items/show/4036,"Feeding the Family",,"History of Food and Drink^^Ann Hertzler Children's Cookbooks and Nutrition Literature Collection","449 pages",,,"Rose, Mary Swartz","History of Food and Drink Collection, Special Collections, University Libraries, Virginia Tech","New York: The Macmillan Company",1916,,,,,,,,,,"In the public domain.",,,,,,,,,,,,,,,,,,,,,Books,TX551.R67_1916,,,,,,,,,,,,,,,,,,,,,,,,,,,,,,,,,,,,,,,,,,,,,,,,,PDF,,,,,,,,,,,,,,,,,,,,,,,,,,,,,,,,,,,https://digitalsc.lib.vt.edu/files/original/4036/TX551.R67_1916.pdf,Document,"History of Food & Drink Collection Rare Books & Publications",1,0
4034,https://digitalsc.lib.vt.edu/items/show/4034,"A Laboratory Hand-book for Dietetics",,"History of Food and Drink","127 pages",,,"Rose, Mary Swartz","History of Food and Drink Collection, Special Collections, University Libraries, Virginia Tech","New York: The Macmillan Company",1912,,,,,,,,,,"In the public domain.",,,,,,,,,,,,,,,,,,,,,Books,TX551.R7_1912,,,,,,,,,,,,,,,,,,,,,,,,,,,,,,,,,,,,,,,,,,,,,,,,,PDF,,,,,,,,,,,,,,,,,,,,,,,,,,,,,,,,,,,https://digitalsc.lib.vt.edu/files/original/4034/TX551.R7_1912.pdf,Document,"History of Food & Drink Collection Rare Books & Publications",1,0
4031,https://digitalsc.lib.vt.edu/items/show/4031,"Mrs. Rorer's Diet for the Sick; Dietetic Treating of Diseases of the Body",,"History of Food and Drink","557 pages",,,"Rorer, Sarah Tyson Heston","History of Food and Drink Collection, Special Collections, University Libraries, Virginia Tech","Philadelphia: Arnold and Company",1914,,,,,,,,,,"In the public domain.",,,,,,,,,,,,,,,,,,,,,Books,RM219.R7_1914,,,,,,,,,,,,,,,,,,,,,,,,,,,,,,,,,,,,,,,,,,,,,,,,,PDF,,,,,,,,,,,,,,,,,,,,,,,,,,,,,,,,,,,https://digitalsc.lib.vt.edu/files/original/4031/RM219.R7_1914.pdf,Document,"History of Food & Drink Collection Rare Books & Publications",1,0
4029,https://digitalsc.lib.vt.edu/items/show/4029,"Mrs. Rorer's Philadelphia Cook Book. A Manual of Home Economics",,"History of Food and Drink","394 pages",,,"Rorer, Sarah Tyson Heston","History of Food and Drink Collection, Special Collections, University Libraries, Virginia Tech","Philadelphia: Arnold and Company",1914,,,,,,,,,,"In the public domain.",,,,,,,,,,,,,,,,,,,,,Books,TX715.R815_1914,,,,,,,,,,,,,,,,,,,,,,,,,,,,,,,,,,,,,,,,,,,,,,,,,PDF,,,,,,,,,,,,,,,,,,,,,,,,,,,,,,,,,,,https://digitalsc.lib.vt.edu/files/original/4029/TX715.R815_1914.pdf,Document,"History of Food & Drink Collection Rare Books & Publications",1,0
4028,https://digitalsc.lib.vt.edu/items/show/4028,"The Chemistry of Cooking and Cleaning: A Manual for House Keeper",,"History of Food and Drink","186 pages",,,"Richards, Ellen H.|Elliott, S. Maria","History of Food and Drink Collection, Special Collections, University Libraries, Virginia Tech","Boston: Whitcomb & Barrows",1907,,,,,,,,,,"In the public domain.",,,,,,,,,,,,,,,,,,,,,Books,TX531.R53_1907,,,,,,,,,,,,,,,,,,,,,,,,,,,,,,,,,,,,,,,,,,,,,,,,,PDF,,,,,,,,,,,,,,,,,,,,,,,,,,,,,,,,,,,https://digitalsc.lib.vt.edu/files/original/4028/TX531.R53_1907.pdf,Document,"History of Food & Drink Collection Rare Books & Publications",1,0
4649,https://digitalsc.lib.vt.edu/items/show/4649,"The Dietary Computer. Explanatory Pamphlet; the Pamphlet Containing Tables of Food Composition, Lists of Prices, Weights, and Measures, Selected Recipes for the Slips, Directions for Using the Same. ",,"History of Food and Drink","Selected pages from the book and supplement.",,,"Richards, Ellen H. (Ellen Henrietta), 1842-1911","History of Food and Drink Collection, Special Collections, University Libraries, Virginia Tech","New York, J. Wiley & sons",1902,,,,,,,,,,"In the public domain.",,,,,,,,,,"For more information on the item and its author, see ""<a href=""https://whatscookinvt.wordpress.com/2012/11/28/dietary-computer-1902/"" target=""_blank"">Dietary Computing in 1902</a>"" on the ""What's Cookin' @Special Collections?"" blog.",,,,,,,,,,,Books,TX551.R51_1902,,,,,,,,,,,,,,,,,,,,,,,,,,,,,,,,,,,,,,,,,,,,,,,,,,,,,,,,,,,,,,,,,,,,,,,,,,,,,,,,,,,,"https://digitalsc.lib.vt.edu/files/original/4649/TX551R511902_tp.jpg,https://digitalsc.lib.vt.edu/files/original/4649/TX551R511902_2.jpg,https://digitalsc.lib.vt.edu/files/original/4649/TX551R511902_8.jpg,https://digitalsc.lib.vt.edu/files/original/4649/TX551R511902_30.jpg,https://digitalsc.lib.vt.edu/files/original/4649/TX551R511902_52.jpg,https://digitalsc.lib.vt.edu/files/original/4649/TX551R511902_sup1.jpg,https://digitalsc.lib.vt.edu/files/original/4649/TX551R511902_sup2.jpg,https://digitalsc.lib.vt.edu/files/original/4649/TX551R511902_sup3.jpg","Still Image","History of Food & Drink Collection Rare Books & Publications",1,0
13913,https://digitalsc.lib.vt.edu/items/show/13913,"Modern Priscilla Home Furnishing Book",,"Home economics^^Interior decoration^^History of Food and Drink",,,,"Priscilla Publishing Company","History of Food and Drink Collection, Special Collections and University Archives, University Libraries, Virginia Tech","Boston, Mass.: Priscilla Publishing Co.",1925,,,,,,,,,,"NoC-US. The organization that has made the Item available believes that the Item is in the Public Domain under the laws of the United States, but a determination was not made as to its copyright status under the copyright laws of other countries. The Item may not be in the Public Domain under the laws of other countries. Please refer to the organization that has made the Item available for more information. <a href=""https://rightsstatements.org/page/NoC-US/1.0/?language=en"" target=""_blank"" rel=""noreferrer noopener"">https://rightsstatements.org/page/NoC-US/1.0/?language=en</a>",,,,,,,,,"History of Food & Drink Collection Rare Books & Publications",,,,,,,,application/pdf,"340 pages",,English,Books,TX311.P75_1925,,,,,,,,,,,,,,,,,,,,,,,,,,,,,,,,,,,,,,,,,,,,,,,,,PDF,,,,,,,,,,,,,,,,,,,,,,,,,,,,,,,,,,,https://digitalsc.lib.vt.edu/files/original/b8b26bf53ac5bded0d2e07f3a9a033fa.pdf,Document,"History of Food & Drink Collection Rare Books & Publications",1,0
4024,https://digitalsc.lib.vt.edu/items/show/4024,"Housekeeping in the Blue Grass",,"History of Food and Drink","184 pages",,,"Presbyterian Church in the U.S.A. Synod of Kentucky.","History of Food and Drink Collection, Special Collections, University Libraries, Virginia Tech","Cincinnati: R. Clarke",1881,,,,,,,,,,"In the public domain.",,,,,,,,,,,,,,,,,,,,,Books,TX715.H834_1881,,,,,,,,,,,,,,,,,,,,,,,,,,,,,,,,,,,,,,,,,,,,,,,,,PDF,,,,,,,,,,,,,,,,,,,,,,,,,,,,,,,,,,,https://digitalsc.lib.vt.edu/files/original/4024/TX715.H834_1881.pdf,Document,"History of Food & Drink Collection Rare Books & Publications",1,0
4020,https://digitalsc.lib.vt.edu/items/show/4020,"Successful Canning and Preserving; Practical Hand Book for Schools, Clubs, and Home Use",,"History of Food and Drink|Food Technology and Production","371 pages",,,"Powell, Ola","History of Food and Drink Collection, Special Collections, University Libraries, Virginia Tech","Philadelphia: J. B. Lippencott Company",1917,,,,,,,,,,"In the public domain.",,,,,,,,,,,,,,,,,,,,,Books,TX601.P7,,,,,,,,,,,,,,,,,,,,,,,,,,,,,,,,,,,,,,,,,,,,,,,,,PDF,,,,,,,,,,,,,,,,,,,,,,,,,,,,,,,,,,,https://digitalsc.lib.vt.edu/files/original/4020/TX601.P7.pdf,Document,"History of Food & Drink Collection Rare Books & Publications",1,0
4019,https://digitalsc.lib.vt.edu/items/show/4019,"Diet and Health: With Key to the Calories",,"History of Food and Drink","127 pages",,,"Peters, Lulu Hunt","History of Food and Drink Collection, Special Collections, University Libraries, Virginia Tech","Chicago: Reilly and Lee Co.",1918,,,,,,,,,,"In the public domain.",,,,,,,,,,,,,,,,,,,,,Books,RM216.P5_1918,,,,,,,,,,,,,,,,,,,,,,,,,,,,,,,,,,,,,,,,,,,,,,,,,PDF,,,,,,,,,,,,,,,,,,,,,,,,,,,,,,,,,,,https://digitalsc.lib.vt.edu/files/original/4019/RM216.P5_1918.pdf,Document,"History of Food & Drink Collection Rare Books & Publications",1,0
4017,https://digitalsc.lib.vt.edu/items/show/4017,"Home Economics; A Practical Guide in Every Branch of Housekeeping",,"History of Food and Drink","416 pages",,,"Parloa, Maria","History of Food and Drink Collection, Special Collections, University Libraries, Virginia Tech","New York: Century",1915,,,,,,,,,,"In the public domain.",,,,,,,,,,,,,,,,,,,,,Books,TX145.P26_1915,,,,,,,,,,,,,,,,,,,,,,,,,,,,,,,,,,,,,,,,,,,,,,,,,PDF,,,,,,,,,,,,,,,,,,,,,,,,,,,,,,,,,,,https://digitalsc.lib.vt.edu/files/original/4017/TX145.P26_1915.pdf,Document,"History of Food & Drink Collection Rare Books & Publications",1,0
4015,https://digitalsc.lib.vt.edu/items/show/4015,"From Kitchen to Garret: Hints for Young Householders",,"History of Food and Drink","243 pages",,,"Panton, J. E. (Jane Ellen)","History of Food and Drink Collection, Special Collections, University Libraries, Virginia Tech","London: Ward & Downey",1890,,,,,,,,,,"In the public domain.",,,,,,,,,,,,,,,,,,,,,Books,TX321.P35_1890,,,,,,,,,,,,,,,,,,,,,,,,,,,,,,,,,,,,,,,,,,,,,,,,,PDF,,,,,,,,,,,,,,,,,,,,,,,,,,,,,,,,,,,https://digitalsc.lib.vt.edu/files/original/4015/TX321.P35_1890.pdf,Document,"History of Food & Drink Collection Rare Books & Publications",1,0
21404,https://digitalsc.lib.vt.edu/items/show/21404,"Still More Secrets",,"History of Food and Drink^^Advertisements","An advertising pamphlet by Pabst Brewing, seemingly a sequel to the previous one, advertising a variety of tonics through stories and customer testimonials. Contains many illustrations.",,,"Pabst Brewing Co.",,,1890,,,,,,,,,,"In the public domain",,,,,,,,,"RM 671 P334 S755 1890 Spec small",,,,,,,,application/pdf,,,English,Pamphlets,RM671P334S7551890,,,,,,,,,,,,,"Special Collections and University Archives, Virginia Tech",,,,,,,,,,,,,,,,,,,,,,,,,,,,,,,,,,,,PDF,,,,,,,,,,,,,,,,,,,,,,,,,,,,,,,,,,,https://digitalsc.lib.vt.edu/files/original/cbde089ff26f0b63abc9bd88bf3311c8.pdf,Document,"History of Food & Drink Collection Rare Books & Publications",1,0
21402,https://digitalsc.lib.vt.edu/items/show/21402,"Untold Secrets",,"History of Food and Drink^^Advertisements","An advertising pamphlet by Pabst Brewing advertising a variety of tonics through stories and customer testimonials. Contains many illustrations.",,,"Pabst Brewing Co.","<a href=""https://catalog.lib.vt.edu/cgi-bin/koha/opac-detail.pl?biblionumber=1274425&amp;query_desc=Untold%20Secrets"" target=""_blank"" rel=""noreferrer noopener""></a>",,1892,,,,,,,,,,"In the public domain",,,,,,,,,"HD 9397 U54 P18 1892 Spec small",,,,,,,,application/pdf,,,English,Pamphlets,HD9397U54P181892,,,,,,,,,,,,,"Special Collections and University Archives, Virginia Tech",,,,,,,,,,,,,,,,,,,,,,,,,,,,,,,,,,,,,,,,,,,,,,,,,,,,,,,,,,,,,,,,,,,,,,,https://digitalsc.lib.vt.edu/files/original/73ed86c09ae9189f7665d96262a4a80f.pdf,Document,"History of Food & Drink Collection Rare Books & Publications",1,0
4014,https://digitalsc.lib.vt.edu/items/show/4014,"Mrs. Owens' Cook Book and Useful Hints for the Household",,"History of Food and Drink","368 pages",,,"Owens, Frances E.","History of Food and Drink Collection, Special Collections, University Libraries, Virginia Tech","Chicago: Household Helps",1882,,,,,,,,,,"In the public domain.",,,,,,,,,,,,,,,,,,,,,Books,TX715.O93_1882,,,,,,,,,,,,,,,,,,,,,,,,,,,,,,,,,,,,,,,,,,,,,,,,,PDF,,,,,,,,,,,,,,,,,,,,,,,,,,,,,,,,,,,https://digitalsc.lib.vt.edu/files/original/4014/TX715.O93_1882.pdf,Document,"History of Food & Drink Collection Rare Books & Publications",1,0
3897,https://digitalsc.lib.vt.edu/items/show/3897,"The Housekeeper's Assistant, Composed Upon Temperance Principles",,"History of Food and Drink","142 pages",,,"Old housekeeper","History of Food and Drink Collection, Special Collections, University Libraries, Virginia Tech","Boston: J. Munroe",1845,,,,,,,,,,"In the public domain.",,,,,,,,,,,,,,,,,,,,,Books,TX715.A44_1845,,,,,,,,,,,,,,,,,,,,,,,,,,,,,,,,,,,,,,,,,,,,,,,,,PDF,,,,,,,,,,,,,,,,,,,,,,,,,,,,,,,,,,,https://digitalsc.lib.vt.edu/files/original/3897/TX715.A44_1845.pdf,Document,"History of Food & Drink Collection Rare Books & Publications",1,0
4012,https://digitalsc.lib.vt.edu/items/show/4012,"Household Management",,"History of Food and Drink","170 pages",,,"Nesbitt, Florence","History of Food and Drink Collection, Special Collections, University Libraries, Virginia Tech","New York: Russell Sage Foundation",1918,,,,,,,,,,"In the public domain.",,,,,,,,,,,,,,,,,,,,,Books,TX145.N4_1918,,,,,,,,,,,,,,,,,,,,,,,,,,,,,,,,,,,,,,,,,,,,,,,,,PDF,,,,,,,,,,,,,,,,,,,,,,,,,,,,,,,,,,,https://digitalsc.lib.vt.edu/files/original/4012/TX145.N4_1918.pdf,Document,"History of Food & Drink Collection Rare Books & Publications",1,0
4010,https://digitalsc.lib.vt.edu/items/show/4010,"The Every-Day Cook-book and Encyclopedia of Practical Recipes",,"History of Food and Drink","315 pages",,,"Neill, E.","History of Food and Drink Collection, Special Collections, University Libraries, Virginia Tech","Chicago: Donohue, Henneberry",1892,,,,,,,,,,"In the public domain.",,,,,,,,,,,,,,,,,,,,,Books,TX715.N359_1892,,,,,,,,,,,,,,,,,,,,,,,,,,,,,,,,,,,,,,,,,,,,,,,,,PDF,,,,,,,,,,,,,,,,,,,,,,,,,,,,,,,,,,,https://digitalsc.lib.vt.edu/files/original/4010/TX715.N359_1892.pdf,Document,"History of Food & Drink Collection Rare Books & Publications",1,0
4008,https://digitalsc.lib.vt.edu/items/show/4008,"Ryzon Baking Book: a Practical Manual for the Preparation of Food Requiring Baking Powder",,"History of Food and Drink|Food Technology and Production","80 pages",,,"Neil, Marion Harris","History of Food and Drink Collection, Special Collections, University Libraries, Virginia Tech","New York: General Chemical Co., Food Department",1917,,,,,,,,,,"In the public domain.",,,,,,,,,,,,,,,,,,,,,Books,TX652.R9_1917,,,,,,,,,,,,,,,,,,,,,,,,,,,,,,,,,,,,,,,,,,,,,,,,,PDF,,,,,,,,,,,,,,,,,,,,,,,,,,,,,,,,,,,https://digitalsc.lib.vt.edu/files/original/4008/TX652.R9_1917.pdf,Document,"History of Food & Drink Collection Rare Books & Publications",1,0
4006,https://digitalsc.lib.vt.edu/items/show/4006,"A ""Calendar of Dinners"" with 615 Recipes; Including the Story of Crisco",,"History of Food and Drink","231 pages",,,"Neil, Marion Harris","History of Food and Drink Collection, Special Collections, University Libraries, Virginia Tech","Cincinnati: Proctor & Gamble Co.",1915,,,,,,,,,,"In the public domain.",,,,,,,,,,,,,,,,,,,,,Books,TX714.N44_1915,,,,,,,,,,,,,,,,,,,,,,,,,,,,,,,,,,,,,,,,,,,,,,,,,PDF,,,,,,,,,,,,,,,,,,,,,,,,,,,,,,,,,,,https://digitalsc.lib.vt.edu/files/original/4006/TX714.N44_1915.pdf,Document,"History of Food & Drink Collection Rare Books & Publications",1,0
4004,https://digitalsc.lib.vt.edu/items/show/4004,"The Story of Crisco",,"History of Food and Drink","231 pages",,,"Neil, Marion Harris","History of Food and Drink Collection, Special Collections, University Libraries, Virginia Tech","Cincinnati: Proctor & Gamble Co.",1914,,,,,,,,,,"In the public domain.",,,,,,,,,,,,,,,,,,,,,Books,TX714.N44_1914,,,,,,,,,,,,,,,,,,,,,,,,,,,,,,,,,,,,,,,,,,,,,,,,,PDF,,,,,,,,,,,,,,,,,,,,,,,,,,,,,,,,,,,https://digitalsc.lib.vt.edu/files/original/4004/TX714.N44_1914.pdf,Document,"History of Food & Drink Collection Rare Books & Publications",1,0
4002,https://digitalsc.lib.vt.edu/items/show/4002,"Murrey's Salads and Sauces",,"History of Food and Drink","280 pages",,,"Murrey, Thomas J.","History of Food and Drink Collection, Special Collections, University Libraries, Virginia Tech","New York: Chas. T. Dillingham",1884,,,,,,,,,,"In the public domain.",,,,,,,,,,,,,,,,,,,,,Books,TX807.M96_1884,,,,,,,,,,,,,,,,,,,,,,,,,,,,,,,,,,,,,,,,,,,,,,,,,PDF,,,,,,,,,,,,,,,,,,,,,,,,,,,,,,,,,,,https://digitalsc.lib.vt.edu/files/original/4002/TX807.M96_1884.pdf,Document,"History of Food & Drink Collection Rare Books & Publications",1,0
4000,https://digitalsc.lib.vt.edu/items/show/4000,"Household Discoveries: an Encyclopaedia of Practical Recipes and Processes",,"History of Food and Drink","1 v. (various pagings)",,,"Morse, Sidney","History of Food and Drink Collection, Special Collections, University Libraries, Virginia Tech","New York: The Success Company",1909,,,,,,,,,,"In the public domain.",,,,,,,,,,,,,,,,,,,,,Books,TX145.M82_1909,,,,,,,,,,,,,,,,,,,,,,,,,,,,,,,,,,,,,,,,,,,,,,,,,PDF,,,,,,,,,,,,,,,,,,,,,,,,,,,,,,,,,,,https://digitalsc.lib.vt.edu/files/original/4000/TX145.M82_1909.pdf,Document,"History of Food & Drink Collection Rare Books & Publications",1,0
3999,https://digitalsc.lib.vt.edu/items/show/3999,"Diseases of Nutrition and Infant Feeding",,"Ann Hertzler Children's Cookbooks and Nutrition Literature Collection^^History of Food and Drink","346 pages",,,"Morse, John Lovett","History of Food and Drink Collection, Special Collections, University Libraries, Virginia Tech","New York: The Macmillan Company",1916,,,,,,,,,,"In the public domain.",,,,,,,,,,,,,,,,,,,,,Books,RJ216.M67_1916,,,,,,,,,,,,,,,,,,,,,,,,,,,,,,,,,,,,,,,,,,,,,,,,,PDF,,,,,,,,,,,,,,,,,,,,,,,,,,,,,,,,,,,https://digitalsc.lib.vt.edu/files/original/3999/RJ216.M67_1916.pdf,Document,"History of Food & Drink Collection Rare Books & Publications",1,0
3998,https://digitalsc.lib.vt.edu/items/show/3998,"Household Science and Arts",,"History of Food and Drink","256 pages",,,"Morris, Josephine","History of Food and Drink Collection, Special Collections, University Libraries, Virginia Tech","New York: American Book Co.",1913,,,,,,,,,,"In the public domain.",,,,,,,,,,,,,,,,,,,,,Books,TX167.M68_1913,,,,,,,,,,,,,,,,,,,,,,,,,,,,,,,,,,,,,,,,,,,,,,,,,PDF,,,,,,,,,,,,,,,,,,,,,,,,,,,,,,,,,,,https://digitalsc.lib.vt.edu/files/original/3998/TX167.M68_1913.pdf,Document,"History of Food & Drink Collection Rare Books & Publications",1,0
3997,https://digitalsc.lib.vt.edu/items/show/3997,"La Cuisiniere Bourgeoise, Suivie de l'office",,"History of Food and Drink","381 pages",,,Menon,"History of Food and Drink Collection, Special Collections, University Libraries, Virginia Tech","Paris: Librairies Associes",1786,,,,,,,,,,"In the public domain.",,,,,,,,,,,,,,,,,,,,,Books,TX707.M46_1786,,,,,,,,,,,,,,,,,,,,,,,,,,,,,,,,,,,,,,,,,,,,,,,,,PDF,,,,,,,,,,,,,,,,,,,,,,,,,,,,,,,,,,,https://digitalsc.lib.vt.edu/files/original/3997/TX707.M46_1786.pdf,Document,"History of Food & Drink Collection Rare Books & Publications",1,0
3996,https://digitalsc.lib.vt.edu/items/show/3996,"Changes in the Food Supply and Their Relation to Nutrition",,"History of Food and Drink","61 pages",,,"Mendel, Lafayette B.","History of Food and Drink Collection, Special Collections, University Libraries, Virginia Tech","New Haven, CT: Yale University Press",1916,,,,,,,,,,"In the public domain.",,,,,,,,,,,,,,,,,,,,,Books,TX353.M4_1916,,,,,,,,,,,,,,,,,,,,,,,,,,,,,,,,,,,,,,,,,,,,,,,,,PDF,,,,,,,,,,,,,,,,,,,,,,,,,,,,,,,,,,,https://digitalsc.lib.vt.edu/files/original/3996/TX353.M4_1916.pdf,Document,"History of Food & Drink Collection Rare Books & Publications",1,0